{"text_format":"1","workbook":"xlsx","n_sheets":4,"sheets":["Ark3","Ark1","Ark2","Ark4"],"not_rendered":{"charts":5,"images":0,"macros":1,"external_links":0,"defined_names":119,"comments":3,"pivot_tables":0},"unopened":[],"bounds":{"document_bytes":16777216,"sheet_cells":100000,"rows_first":2000,"rows_last":500,"rows_between":2000,"halvings":0,"cell_chars":16384,"cell_head_chars":4096},"cells_cut":0,"cells_raw":0,"read":"whole","date_system":"1900"}

{"sheet":"Ark3","index":0,"n_rows":45,"n_cols":3,"rows_kept":45,"cut":false,"hidden":false,"merged":[[21,2,21,4],[22,2,22,4],[23,2,23,4],[24,2,24,4],[25,2,25,4],[13,2,13,4],[14,2,14,4],[15,2,15,4],[16,2,16,4],[17,2,17,4],[26,2,26,4],[38,2,38,4],[41,2,41,4],[43,2,43,4],[44,2,44,4],[27,2,27,4],[29,2,29,4],[31,2,31,4],[32,2,32,4],[34,2,34,4],[42,2,42,4],[40,2,40,4],[33,2,33,4],[36,2,36,4],[28,2,28,4],[39,2,39,4]]}
[]
[null,"Planteavlerens modelværksted"]
[null,"Udgiver:","SEGES"]
[null,null,"Landbrug & Fødevarer F.m.b.A."]
[null,"Udgivelsesdato:","10. december 2020"]
[null,"Forfatter:","Michael Højholdt / Maria Vejle Madsen (Oprindelig \"økonomi i afgrøder og sædskifter\" af Søren Kolind Hvid)"]
[null,"Version:","2.0"]
[null,"Datagrundlag og opdateringsfrekvens:","Budgetkalkuler 2020 mv. Opdateres efter behov. Vær opmærksom på prisudvikling i forhold til normtal mv."]
[null,"Dokument:","Se artikel"]
[null,"Ansvar:","Se vilkår"]
[]
[]
[null,"Introduktion til regnearket"]
[null,"Angiv formål og målgruppe","Formålet med regnearket er at understøtte planlægning og modellering i markbruget af f.eks. nye afgrøder, afgrødesammensætninger og dyrkningsmetoder. Målgruppen er primært landmænd og landbrugsrådgivere."]
[null,"Anbefalet anvendelse af værktøjet","Økonomi i afgrøder og sædskifter: Værktøjet kan anvendes til at give et bud på økonomien ved dyrkning af forskellige afgrøder og sædskifter under forskellige vilkår. Udbytter og omkostninger er estimeret med basis i afgrødekalkuler og kan tilpasses forhold og dyrkningsmetoder på bedriften. Forfrugtsværdi, husdyrgødning, om man er kornkøber eller -sælger, halmnedmuldning, tørring og lagring kan indregnes i de økonomiske konkurrenceforhold. Der findes uddybede forslag til anvendelse i den faglige vejledning nedenfor.\n\nSædskifteplan: Dette regneark kan anvendes til at opstille en sædskifteplan med op til 3 delsædskifter på en bedrift. Placering af efterafgrøder i sædskiftet kan angives. Endvidere beregnes produktionen af korn til svinefoder. Svinebesætningens foderbehov (korn) kan beregnes. Sædskifteplan er ikke sammenkædet med Økonomi i afgrøder og sædskifter.\n"]
[null,"Begrænsninger i værktøjet","Værktøjet er baseret på normtal, og derfor vil resultaterne for hvert scenarie ikke nødvendigvis matche bedriftens egne tal. Forskellen mellem scenarier forventes dog give et godt bud på den konsekvens, man vil opleve i driften. I vejledning til anvendelse af værktøjet ses forslag til, hvordan normværdier kan tilpasses individuelle forhold.  \n\nVær opmærksom på, at der ingen kontrol er af, at det indtastede afgrødevalg og efterafgrødevalg kan lade sig gøre, om der er risiko for opformering af sygdomme eller ukrudt, om gældende efterafgrødekrav og lovgivning overholdes etc. "]
[null,"Vejledning","Udfyld \"bedriftsspecifikke oplysninger\" (JB, håndtering af halm, husdyrgødning mv.) og justér evt. \"standardforudsætninger\" (forhold omkring næringstoffer mv.). \nOpret evt. egen afgrøde, og definer afgrødevalg/sædskifter til sammenligning. \nAnvend de givne forslag til udbytter og priser eller justér efter behov.\nVed modellering af ændring ved f.eks. nyt dyrkningssystem, er der mulighed for at støtte sig til faglige vejledninger,se nedenfor."]
[null,"Funktion og makroer","Husk at aktivere makroer i Excel"]
[]
[]
[null,"Faglig vejledning til økonomi i afgrøder og sædskifter"]
[null,"Hvis du vil…","...kan du gøre følgende"]
[null,"  … estimere økonomi ved en ændring i afgrødesammensætning, f.eks. supplere korndyrkning med dyrkning af specialafgrøde ","Definere eksisterende afgrødesammensætning i sædskifte 1.\n\nDefinere alternativ afgrødesammensætning i sædskifte 2.\n\nJustere diverse forudsætninger til bedriftens forhold og forventninger.\n\nHuske at dyrkning af mange specialafgrøder kræver kontrakt, muligheden for at få en sådan skal undersøges. \n\nVurdere dyrkningssikkerheden på de to afgrødesammensætninger i forhold til hinanden. \n\nVurdere sandsynligheden for prisudsving i de to afgrødesammensætninger; lav en følsomhedanalyse med høje/lave priser - du kan gemme regneark med forskellige valg af forudsætninger under passende forskellige navne og dermed hurtigt sammenligne ændringer i dine forudsætninger efter behov.\n\nInddragelse af efterafgrøder beregnes kun som omkostninger til etablering og gevinst ved sparet N. Regnearket kan ikke anvendes til optimering af efterafgrødevalg mv. \nHvis der mangler plads til flere afgrøder, kan efterafgrøder evt. kan puljes i én samlet efterafgrøde og dermed spare plads i den økonomiske beregning. Anvend sædskifteplanerne i funktionen \"sædskifteplan\" for at vise den samlede afgrødefølge; her er plads til flere afgrøder i sædskifterne og dermed god plads til at vise efterafgrøder efter hovedafgrøder."]
[null,"  … estimere økonomi for en afgrøde, der ikke findes norm eller afgrødekalkule for ","Oprette egen afgrøde i værktøjet umiddelbart efter indtastning af bedriftsspecifikke oplysninger og standardforudsætninger.\n\nAngive afgrødens navn, forventet udbytte, afgrødepris, og evt. sekundært udbytte (halm), forfrugtsværdi, stykomkostninger, N,P og K mængde, omkostninger til planteværn, diverse, maskiner og arbejde samt tørring. \n\nFinde hjælp til at anslå disse niveauer ved eventuelt sammenlignelige afgrøder via afgrødekalkulerne på farmtal.dk. \n\nUndersøge om der findes udenlandske erfaringer som med fordel kan inddrages i overvejelserne.\n\nHuske det kan være vigtigt at foretage vurdering af risici ved dyrkning af \"nye\" afgrøder, herunder dyrkningssikkerhed og sikkerhed for afsætning.\n"]
[null,"  ... regne på at ændre din maskinpark og sælge maskinstationsydelser til andre","Analysere nuværende maskinomkostninger med en maskinanalyse, kan foretages i planlægningsværktøjet FMS.\n\nOpstille forventet \"ny maskinpark\" og beregne tidsforbrug og økonomi i denne - igen i FMS. Husk egen anvendelse og opstille salgsmål på basis af maskinanalysen og lave en vurdering af totaløkonomi i forhold til indtjening og risiko. Inddrag en vurdering af behov for arbejdskraft. Brug evt. \"Maskintid\" (se link nedenfor) til at vurdere arbejdskraftbehov og spidsbelastninger.\n"]
[null,"   …regne på at ændre dyrkning fra pløjning til reduceret jordbearbejdning eller til no till / conservation agriculture","Definere eksisterende afgrødesammensætning i sædskifte 1.\n\nDefinere alternativ afgrødesammensætning i sædskifte 2, herunder ændret forhold mellem vintersæd og vårsæd, og behov for efterafgrøder. Se kommentar om efterafgrøder ved beregning af sædskifteøkonomi ovenfor.\n\nJustere diverse forudsætninger til bedriftens forhold og forventninger, herunder udbytteniveau og indkøringstab. Bemærk ved anvendelse af beregning af tidsforbrug at tilpasse de udførte maskinopgaver til forventede forhold, herunder med fokus på jordbearbejdning og planteværn.\n\nmaskin- og arbejdsomkostninger bør være i fokus. Hvis ikke der er udarbejdet maskinanalyse og maskinstrategi for omlægning med FMS, bør det gøres. Brug evt. tal fra din driftsgrensanalyse eller lav en grovanalyse med Din Bundlinje Mark som udgangspunkt.\n\nI mange tilfælde vil en sådan omlægning medføre investeringer i nye maskiner, der de første år kan påvirke de samlede maskin- og arbejdsomkostninger i opadgående retning. På lidt længere sigt bør det være muligt at realisere et lavere niveau for maskin- og arbejdsomkostninger end før omlægning hvis jordbearbejdning reduceres eller helt fjernes. \n\nVær opmærksom på, om frigjorte arbejdstimer fra marken kan aflønnes af andet værdiskabende arbejde eller bliver ufordelt omkostning som alligevel skal aflønnes."]
[null,"… vurdere økonomien ved økologisk produktion ","Der findes særskilte værktøjer og metoder til omlægningstjek indenfor økologi. Kontakt din lokale økologirådgiver eller SEGES økologi for at høre mere. \n\nHvis du ønsker at anvende nærværende værktøj til groft at estimere konsekvenser i en sådan situation, kan du anvende de økologiske afgrøder der er udarbejdet kalkuler for i værktøjet, under hensyntagen til management og f.eks. fokus på bekæmpelse af rodukrudt. \n\nØnsker du at anvende beregning af forfrugtsværdi, så husk at tilrette værdien heraf til økologisk. Et alternativ er selv at estimere udbytterne inkl. forfrugtsværdi for den enkelte afgrøde. \n\nVed modellering af økologiske sædskifter er der behov for at være ekstra opmærksom på næringsstoftilførslen, da økologiske bedrifter ikke har samme muligheder for at øge tildelingen af N som konventionelle bedrifter.\n\nKendskabet til nuværende næringsstofforsyning og dennes effekt på udbytteniveauer er afgørende for om udbytteniveau og gødningsomkostning i værktøjet stemmer overens med virkeligheden.\nSåfremt der er behov for at øge tildeling af P og K, giver gødningsværktøjet til økologer (link nedenfor) et overblik over mulige produkter og priser. \n\nHusk at næringsstoffer betyder meget for udbytter, omkostninger og tilskud. Hvis der ikke fuldgødskes med gylle, indreger værktøjet køb af N til den pris, der opgives i standardforudsætninger. Hvis der indkøbes gødning så husk at tilrette pris. Indkøbes der ikke gødning så husk at sætte omkostning = 0.\n\nHusk, at der findes en række tilskudsmuligheder for økologisk produktion. Se den opdaterede liste på www.farmtal.dk > støtteordninger:  \n- økologitilskud 870 kr. pr. ha \n- omlægningstilskud 1.200 pr. år \n- reduceret N tildeling tilskud 500 kr. pr. ha\n- frugt og bær tilllæg kr. 4.000 pr. ha\n\n"]
[null,"   …vurdere økonomien i en forpagtning ","Anvend nedenstående regneark vedrørende økonomi i forpagtninger, hvori der findes oplysninger om niveauer for forpagtningsafgift og mulighed for at beregne økonomi med inddragelse af øndring i dyrket areal også i form af forpagtninger. \n\nTilpas evt. værktøjet med oplysninger om indtjening i marken fra nærværende \"Økonomi i afgrøder og sædskifter\"."]
[null,"…inddrage transportomkostninger i din beregning","Anvende tommelfingerregler eller egne beregninger fra værktøj til beregning af transportomkostninger. De beregnede årlige omkostninger kan indarbejdes i maskin- og arbejdsomkostninger i nærværende program. Se link til beregning af bedrifts- og afgrødespecifikke transportomkostninger nedenfor. \n\nTommelfingerreglerne er: \nDyrkning af korn med handelsgødning og nedmuldning af halm koster ca. 100 kr. pr. km pr. ha pr. år\nDyrkning af korn med gylle og bjærgning af halm eller majs til helsæd koster ca. 200 kr. pr. km pr. ha pr. år\nDyrkning af græs til slæt med gylle koster ca. 300 kr. pr. km pr. ha pr. år "]
[null,"   …sammenholde normtal med din egen præstation","Find inspiration i Business Check hvor der findes gennemsnitstal og fraktilanalyser for indtægter og omkostninger for både salgsafgrøder og grovfoder. \n\nFå lavet egen driftsgrensanalyse hos din rådgivningsvirksomhed, og start eventuelt med at lave egen grovanalyse med værktøjet \"Din Bundlinje Mark\".\n\n"]
[]
[null,"Links til viden og værktøjer"]
[null,"Emne ","Links "]
[null,"Afgrødekalkuler på farmtal.dk","https://farmtalonline.dlbr.dk/Navigation/NavigationTree.aspx"]
[null,"Økonomi ved forpagtning","https://www.landbrugsinfo.dk/basis/f/e/a/produktionsokonomi_regneark_okonomi_ved_forpagtning_opdateret  "]
[null,"Maskintid - sæsonbelastning i marken","https://www.landbrugsinfo.dk/basis/8/7/1/oekonomi_saet_fokus_paa_de_travle_perioder_markdriften  "]
[null,"Transportomkostninger mark-lagre t/r","https://www.landbrugsinfo.dk/public/3/1/6/produktionsokonomi_hvor_meget_koster_transportopgaverne "]
[null,"Markstørrelse, markform, kapacitet","https://www.landbrugsinfo.dk/public/9/0/e/planter_beregn_arbejdsbehovet_ved_markarbejde "]
[null,"FMS - maskinanalyse","https://www.landbrugsinfo.dk/public/e/e/7/produktionsokonomi_planlag_arbejdet_med_vaerktojet_fms "]
[null,"Investeringsberegning maskiner mv.","https://www.landbrugsinfo.dk/public/6/b/5/oekonomi_investeringsberegning_grafisk_foelsomhedsanalyse"]
[null,"Økonomi ved lagring af korn","https://www.landbrugsinfo.dk/public/6/d/3/oekonomi_ved_lagring_af_korn "]
[null,"Conservation agriculture","https://www.landbrugsinfo.dk/basis/1/a/a/jord_bearbejdning_conservation_agriculture "]
[null,"Gødning økologi","https://oko-godning.dk/ "]
[null,"Sammenligningstal - Din Bundlinje Mark","https://www.landbrugsinfo.dk/basis/2/7/3/planter_regnearket_din_bundlinje_mark_klar_til_brug "]
[null,"Sammenligningstal - Business Check","https://www.landbrugsinfo.dk/basis/b/8/8/produktionsokonomi_nyeste_version_business_check"]

{"sheet":"Ark1","index":1,"n_rows":607,"n_cols":152,"rows_kept":607,"cut":false,"hidden":false,"merged":[[50,5,50,7],[51,5,51,7],[42,2,42,5],[45,10,46,13],[46,5,46,8],[0,1,0,10],[315,3,315,4],[291,3,291,4],[293,3,293,4],[295,3,295,4],[311,3,311,4],[4,6,4,7],[6,6,6,7],[8,6,8,7],[297,3,297,4],[301,3,301,4],[211,1,211,2],[85,1,86,1],[235,6,235,7],[238,6,238,7],[239,6,239,7],[305,3,305,4],[289,3,289,4],[64,1,65,1],[307,3,307,4],[231,6,231,7],[232,6,232,7],[233,6,233,7],[226,6,226,7],[219,2,219,3],[219,6,219,7],[233,2,233,3],[229,6,229,7],[220,6,220,7],[227,2,227,3],[227,6,227,7],[221,2,221,3],[221,6,221,7],[223,2,223,3],[224,2,224,3],[225,2,225,3],[226,2,226,3],[224,6,224,7],[223,6,223,7],[225,6,225,7],[415,1,416,1],[433,1,434,2],[299,3,299,4],[220,2,220,3],[239,2,239,3],[229,2,229,3],[231,2,231,3],[238,2,238,3],[232,2,232,3],[235,2,235,3],[313,3,313,4],[397,1,398,1],[390,2,390,3],[309,3,309,4],[303,3,303,4],[286,3,286,4],[505,18,514,21],[235,10,235,11],[433,10,434,11],[233,10,233,11],[468,18,476,21],[395,18,404,21],[348,18,354,21],[437,18,446,21],[384,18,390,21],[239,10,239,11],[285,26,285,30],[219,10,219,11],[220,10,220,11],[221,10,221,11],[223,10,223,11],[224,10,224,11],[226,10,226,11],[227,10,227,11],[229,10,229,11],[231,10,231,11],[232,10,232,11],[225,10,225,11],[237,18,239,20],[184,18,188,20],[5,18,12,23],[85,18,89,21],[27,3,27,4],[17,3,17,4],[19,3,19,4],[21,3,21,4],[23,3,23,4],[25,3,25,4],[29,3,29,4],[31,3,31,4],[33,3,33,4],[39,18,41,23],[64,18,68,21],[39,3,39,13],[45,5,45,7]]}
[null,"Økonomi i afgrøder og sædskifter 2021"]
[]
[null,"Bedriftsoplysninger"]
[null,null,null,null,null,null,null,null,null,null,null,null,null,null,null,null,null,null,null,null,null,null,null,null,null,null,null,null,null,null,null,null,null,null,null,null,null,null,null,null,null,null,null,null,null,null,null,null,null,null,null,null,null,null,null,null,null,null,null,null,null,null,null,null,null,null,null,null,null,null,null,null,null,null,null,null,null,null,null,null,null,null,null,null,null,null,null,null,null,null,null,null,null,null,null,null,null,null,"JB_rækkenr.","Udbytte","N-gødning","Lager_rækkenr","Lagernr",null,null,null,null,null,null,null,"Husdyrgødning"]
[null,"Jordtype",null,null,null,null,"Lager til korn",null,null,null,null,null,null,null,null,null,null,null,null,null,null,null,null,null,null,null,null,null,null,null,null,null,null,null,null,null,null,null,null,null,null,null,null,null,null,null,null,null,null,null,null,null,null,null,null,null,null,null,null,null,null,null,null,null,null,null,null,null,null,null,null,null,null,null,null,null,null,null,null,null,null,null,null,null,null,null,null,null,null,null,null,null,null,null,null,null,null,null,4,{"$f":"IF(CU5=1,5,IF(CU5=2,6,IF(CU5=3,7,IF(CU5=4,8,IF(CU5=5,9,\"\")))))","v":8},{"$f":"IF(CU5=1,25,IF(CU5=2,26,IF(CU5=3,27,IF(CU5=4,28,IF(CU5=5,29,\"\")))))","v":28},2,{"$f":"IF(CX5=1,1,IF(CX5=2,BQ285,IF(CX5=3,BR285,BS285)))","v":52},null,null,null,null,null,null,null,null,"DE/ha","N","P","K"]
[null,null,null,null,null,null,null,null,null,null,null,null,null,null,null,null,null,null,null,null,null,null,null,null,null,null,null,null,null,null,null,null,null,null,null,null,null,null,null,null,null,null,null,null,null,null,null,null,null,null,null,null,null,null,null,null,null,null,null,null,null,null,null,null,null,null,null,null,null,null,null,null,null,null,null,null,null,null,null,null,null,null,null,null,null,null,null,null,null,null,null,null,null,null,null,null,null,null,"Halm","Halm_rækkenr.","Maskinomkostninger","Tørring_rækkenr.","Tørrenr",null,null,null,null,null,null,1,"Ingen",0,0,0,0,null,"ton gylle pr. DE",18]
[null,"Halm bjærges/nedmuldes",null,null,null,null,"Tørring af korn",null,null,null,null,null,null,null,null,null,null,null,null,null,null,null,null,null,null,null,null,null,null,null,null,null,null,null,null,null,null,null,null,null,null,null,null,null,null,null,null,null,null,null,null,null,null,null,null,null,null,null,null,null,null,null,null,null,null,null,null,null,null,null,null,null,null,null,null,null,null,null,null,null,null,null,null,null,null,null,null,null,null,null,null,null,null,null,null,null,null,null,1,{"$f":"IF($CU$7=1,IF($CU$5=1,10,IF($CU$5=2,11,IF($CU$5=3,12,IF($CU$5=4,13,IF($CU$5=5,14,\"\"))))))","v":13},{"$f":"IF($CU$7=1,IF($CU$5=1,39,IF($CU$5=2,40,IF($CU$5=3,41,IF($CU$5=4,42,IF($CU$5=5,43,\"\"))))),IF($CU$5=1,44,IF($CU$5=2,45,IF($CU$5=3,46,IF($CU$5=4,47,IF($CU$5=5,48,\"\"))))))","v":42},2,{"$f":"IF(Tørringnr=1,BN285,BO285)","v":50},null,null,null,null,null,null,2,"10 kg N svin",0.1,{"$f":"DH7*$D$298*UdnytNsvin*0.01","v":8},{"$f":"DH7*$D$300","v":2.5},{"$f":"DH7*$D$302","v":5},null,"DE pr. ha",{"$f":"VLOOKUP(Hdgnr,_Hdg2,3)","v":0}]
[null,null,null,null,null,null,null,null,null,null,null,null,null,null,null,null,null,null,null,null,null,null,null,null,null,null,null,null,null,null,null,null,null,null,null,null,null,null,null,null,null,null,null,null,null,null,null,null,null,null,null,null,null,null,null,null,null,null,null,null,null,null,null,null,null,null,null,null,null,null,null,null,null,null,null,null,null,null,null,null,null,null,null,null,null,null,null,null,null,null,null,null,null,null,null,null,null,null,"Kornkøber","Kornkøber / - sælger",null,"Foderenheder",null,null,null,null,null,null,null,3,"10 kg N kvæg",0.1,{"$f":"DH8*$D$304*UdnytNkvæg*0.01","v":7.5},{"$f":"DH8*$D$306","v":1.7000000000000002},{"$f":"DH8*$D$308","v":6.7}]
[null,"Kornsælger eller kornkøber",null,null,null,null,"Foderenheder",null,null,null,null,null,null,null,null,null,null,null,null,null,null,null,null,null,null,null,null,null,null,null,null,null,null,null,null,null,null,null,null,null,null,null,null,null,null,null,null,null,null,null,null,null,null,null,null,null,null,null,null,null,null,null,null,null,null,null,null,null,null,null,null,null,null,null,null,null,null,null,null,null,null,null,null,null,null,null,null,null,null,null,null,null,null,null,null,null,null,null,1,{"$f":"IF(CU9=2,IF(CU5=1,5,IF(CU5=2,6,IF(CU5=3,7,IF(CU5=4,8,IF(CU5=5,9,\"\"))))),\"\")","v":""},null,2,null,null,null,null,null,null,null,4,"30 kg N svin",0.3,{"$f":"DH9*$D$298*UdnytNsvin*0.01","v":24},{"$f":"DH9*$D$300","v":7.5},{"$f":"DH9*$D$302","v":15}]
[null,null,null,null,null,null,null,null,null,null,null,null,null,null,null,null,null,null,null,null,null,null,null,null,null,null,null,null,null,null,null,null,null,null,null,null,null,null,null,null,null,null,null,null,null,null,null,null,null,null,null,null,null,null,null,null,null,null,null,null,null,null,null,null,null,null,null,null,null,null,null,null,null,null,null,null,null,null,null,null,null,null,null,null,null,null,null,null,null,null,null,null,null,null,null,null,null,null,"Hdg_rækkenr","Styk uden eller med husdyrgødning",null,null,null,null,null,null,null,null,null,5,"30 kg N kvæg",0.3,{"$f":"DH10*$D$304*UdnytNkvæg*0.01","v":22.5},{"$f":"DH10*$D$306","v":5.0999999999999996},{"$f":"DH10*$D$308","v":20.099999999999998}]
[null,"Husdyrgødning",null,null,null,null,null,null,null,null,null,null,null,null,null,null,null,null,null,null,null,null,null,null,null,null,null,null,null,null,null,null,null,null,null,null,null,null,null,null,null,null,null,null,null,null,null,null,null,null,null,null,null,null,null,null,null,null,null,null,null,null,null,null,null,null,null,null,null,null,null,null,null,null,null,null,null,null,null,null,null,null,null,null,null,null,null,null,null,null,null,null,null,null,null,null,null,null,1,{"$f":"IF(CU11=1,IF($CU$5=1,21,IF($CU$5=2,22,IF($CU$5=3,23,IF($CU$5=4,24,IF($CU$5=5,25,\"\"))))),IF($CU$5=1,26,IF($CU$5=2,27,IF($CU$5=3,28,IF($CU$5=4,29,IF($CU$5=5,30,\"\"))))))","v":24},null,null,null,null,null,null,null,null,null,6,"50 kg N svin",0.5,{"$f":"DH11*$D$298*UdnytNsvin*0.01","v":40},{"$f":"DH11*$D$300","v":12.5},{"$f":"DH11*$D$302","v":25}]
[null,null,null,null,null,null,null,null,null,null,null,null,null,null,null,null,null,null,null,null,null,null,null,null,null,null,null,null,null,null,null,null,null,null,null,null,null,null,null,null,null,null,null,null,null,null,null,null,null,null,null,null,null,null,null,null,null,null,null,null,null,null,null,null,null,null,null,null,null,null,null,null,null,null,null,null,null,null,null,null,null,null,null,null,null,null,null,null,null,null,null,null,null,null,null,null,null,null,null,"Forfrugtsværdi",null,null,null,null,null,null,null,null,null,7,"50 kg N kvæg",0.5,{"$f":"DH12*$D$304*UdnytNkvæg*0.01","v":37.5},{"$f":"DH12*$D$306","v":8.5},{"$f":"DH12*$D$308","v":33.5}]
[null,"Forfrugtsværdi til forfrugten",null,null,null,null,null,null,null,null,null,null,null,null,null,null,null,null,null,null,null,null,null,null,null,null,null,null,null,null,null,null,null,null,null,null,null,null,null,null,null,null,null,null,null,null,null,null,null,null,null,null,null,null,null,null,null,null,null,null,null,null,null,null,null,null,null,null,null,null,null,null,null,null,null,null,null,null,null,null,null,null,null,null,null,null,null,null,null,null,null,null,null,null,null,null,null,null,2,{"$f":"IF(CU13=1,IF($CU$5=1,15,IF($CU$5=2,16,IF($CU$5=3,17,IF($CU$5=4,18,IF($CU$5=5,19,\"\"))))))","v":false},null,null,null,null,null,null,null,null,null,8,"70 kg N svin",0.7,{"$f":"DH13*$D$298*UdnytNsvin*0.01","v":56},{"$f":"DH13*$D$300","v":17.5},{"$f":"DH13*$D$302","v":35}]
[null,null,null,null,null,null,null,null,null,null,null,null,null,null,null,null,null,null,null,null,null,null,null,null,null,null,null,null,null,null,null,null,null,null,null,null,null,null,null,null,null,null,null,null,null,null,null,null,null,null,null,null,null,null,null,null,null,null,null,null,null,null,null,null,null,null,null,null,null,null,null,null,null,null,null,null,null,null,null,null,null,null,null,null,null,null,null,null,null,null,null,null,null,null,null,null,null,null,null,null,null,null,null,null,null,null,null,null,null,9,"70 kg N kvæg",0.7,{"$f":"DH14*$D$304*UdnytNkvæg*0.01","v":52.5},{"$f":"DH14*$D$306","v":11.899999999999999},{"$f":"DH14*$D$308","v":46.9}]
[null,null,null,null,null,null,null,null,null,null,null,null,null,null,null,null,null,null,null,null,null,null,null,null,null,null,null,null,null,null,null,null,null,null,null,null,null,null,null,null,null,null,null,null,null,null,null,null,null,null,null,null,null,null,null,null,null,null,null,null,null,null,null,null,null,null,null,null,null,null,null,null,null,null,null,null,null,null,null,null,null,null,null,null,null,null,null,null,null,null,null,null,null,null,null,null,null,null,null,null,null,null,null,null,null,null,null,null,null,10,"80 kg N svin",0.8,{"$f":"DH15*$D$298*UdnytNsvin*0.01","v":64},{"$f":"DH15*$D$300","v":20},{"$f":"DH15*$D$302","v":40}]
[null,"Standardforudsætninger",null,null,null,null,null,null,null,null,null,null,null,null,null,null,null,null,null,null,null,null,null,null,null,null,null,null,null,null,null,null,null,null,null,null,null,null,null,null,null,null,null,null,null,null,null,null,null,null,null,null,null,null,null,null,null,null,null,null,null,null,null,null,null,null,null,null,null,null,null,null,null,null,null,null,null,null,null,null,null,null,null,null,null,null,null,null,null,null,null,null,null,null,null,null,null,null,null,null,null,null,null,null,null,null,null,null,null,11,"80 kg N kvæg",0.8,{"$f":"DH16*$D$304*UdnytNkvæg*0.01","v":60},{"$f":"DH16*$D$306","v":13.600000000000001},{"$f":"DH16*$D$308","v":53.6}]
[null,null,null,null,null,null,null,null,null,null,null,null,null,null,null,null,null,null,null,null,null,null,null,null,null,null,null,null,null,null,null,null,null,null,null,null,null,null,null,null,null,null,null,null,null,null,null,null,null,null,null,null,null,null,null,null,null,null,null,null,null,null,null,null,null,null,null,null,null,null,null,null,null,null,null,null,null,null,null,null,null,null,null,null,null,null,null,null,null,null,null,null,null,null,null,null,null,null,null,null,null,null,null,null,null,null,null,null,null,12,"90 kg N svin",0.9,{"$f":"DH17*$D$298*UdnytNsvin*0.01","v":72},{"$f":"DH17*$D$300","v":22.5},{"$f":"DH17*$D$302","v":45}]
[null,"Kvælstofpris",null,5.5,null,"pr. kg",null,null,null,null,null,null,null,null,null,null,null,null,null,null,null,null,null,null,null,null,null,null,null,null,null,null,null,null,null,null,null,null,null,null,null,null,null,null,null,null,null,null,null,null,null,null,null,null,null,null,null,null,null,null,null,null,null,null,null,null,null,null,null,null,null,null,null,null,null,null,null,null,null,null,null,null,null,null,null,null,null,null,null,null,null,null,null,null,null,null,null,null,null,null,null,null,null,null,null,null,null,null,null,13,"90 kg N kvæg",0.9,{"$f":"DH18*$D$304*UdnytNkvæg*0.01","v":67.5},{"$f":"DH18*$D$306","v":15.3},{"$f":"DH18*$D$308","v":60.300000000000004}]
[null,null,null,null,null,null,null,null,null,null,null,null,null,null,null,null,null,null,null,null,null,null,null,null,null,null,null,null,null,null,null,null,null,null,null,null,null,null,null,null,null,null,null,null,null,null,null,null,null,null,null,null,null,null,null,null,null,null,null,null,null,null,null,null,null,null,null,null,null,null,null,null,null,null,null,null,null,null,null,null,null,null,null,null,null,null,null,null,null,null,null,null,null,null,null,null,null,null,null,null,null,null,null,null,null,null,null,null,null,14,"100 kg N svin",1,{"$f":"DH19*$D$298*UdnytNsvin*0.01","v":80},{"$f":"DH19*$D$300","v":25},{"$f":"DH19*$D$302","v":50}]
[null,"Fosforpris",null,9,null,"pr. kg",null,null,null,null,null,null,null,null,null,null,null,null,null,null,null,null,null,null,null,null,null,null,null,null,null,null,null,null,null,null,null,null,null,null,null,null,null,null,null,null,null,null,null,null,null,null,null,null,null,null,null,null,null,null,null,null,null,null,null,null,null,null,null,null,null,null,null,null,null,null,null,null,null,null,null,null,null,null,null,null,null,null,null,null,null,null,null,null,null,null,null,null,null,null,null,null,null,null,null,null,null,null,null,15,"100 kg N kvæg",1,{"$f":"DH20*$D$304*UdnytNkvæg*0.01","v":75},{"$f":"DH20*$D$306","v":17},{"$f":"DH20*$D$308","v":67}]
[null,null,null,null,null,null,null,null,null,null,null,null,null,null,null,null,null,null,null,null,null,null,null,null,null,null,null,null,null,null,null,null,null,null,null,null,null,null,null,null,null,null,null,null,null,null,null,null,null,null,null,null,null,null,null,null,null,null,null,null,null,null,null,null,null,null,null,null,null,null,null,null,null,null,null,null,null,null,null,null,null,null,null,null,null,null,null,null,null,null,null,null,null,null,null,null,null,null,null,null,null,null,null,null,null,null,null,null,null,16,"110 kg N svin",1.1000000000000001,{"$f":"DH21*$D$298*UdnytNsvin*0.01","v":88.000000000000014},{"$f":"DH21*$D$300","v":27.500000000000004},{"$f":"DH21*$D$302","v":55.000000000000007}]
[null,"Kaliumpris",null,6,null,"pr. kg",null,null,null,null,null,null,null,null,null,null,null,null,null,null,null,null,null,null,null,null,null,null,null,null,null,null,null,null,null,null,null,null,null,null,null,null,null,null,null,null,null,null,null,null,null,null,null,null,null,null,null,null,null,null,null,null,null,null,null,null,null,null,null,null,null,null,null,null,null,null,null,null,null,null,null,null,null,null,null,null,null,null,null,null,null,null,null,null,null,null,null,null,null,null,null,null,null,null,null,null,null,null,null,17,"110 kg N kvæg",1.1000000000000001,{"$f":"DH22*$D$304*UdnytNkvæg*0.01","v":82.500000000000014},{"$f":"DH22*$D$306","v":18.700000000000003},{"$f":"DH22*$D$308","v":73.7}]
[null,null,null,null,null,null,null,null,null,null,null,null,null,null,null,null,null,null,null,null,null,null,null,null,null,null,null,null,null,null,null,null,null,null,null,null,null,null,null,null,null,null,null,null,null,null,null,null,null,null,null,null,null,null,null,null,null,null,null,null,null,null,null,null,null,null,null,null,null,null,null,null,null,null,null,null,null,null,null,null,null,null,null,null,null,null,null,null,null,null,null,null,null,null,null,null,null,null,null,null,null,null,null,null,null,null,null,null,null,18,"120 kg N svin",1.2,{"$f":"DH23*$D$298*UdnytNsvin*0.01","v":96},{"$f":"DH23*$D$300","v":30},{"$f":"DH23*$D$302","v":60}]
[null,"Meromkostning til erstatningskorn",null,15,null,"pr. hkg",null,null,null,null,null,null,null,null,null,null,null,null,null,null,null,null,null,null,null,null,null,null,null,null,null,null,null,null,null,null,null,null,null,null,null,null,null,null,null,null,null,null,null,null,null,null,null,null,null,null,null,null,null,null,null,null,null,null,null,null,null,null,null,null,null,null,null,null,null,null,null,null,null,null,null,null,null,null,null,null,null,null,null,null,null,null,null,null,null,null,null,null,null,null,null,null,null,null,null,null,null,null,null,19,"120 kg N kvæg",1.2,{"$f":"DH24*$D$304*UdnytNkvæg*0.01","v":90},{"$f":"DH24*$D$306","v":20.399999999999999},{"$f":"DH24*$D$308","v":80.399999999999991}]
[null,null,null,null,null,null,null,null,null,null,null,null,null,null,null,null,null,null,null,null,null,null,null,null,null,null,null,null,null,null,null,null,null,null,null,null,null,null,null,null,null,null,null,null,null,null,null,null,null,null,null,null,null,null,null,null,null,null,null,null,null,null,null,null,null,null,null,null,null,null,null,null,null,null,null,null,null,null,null,null,null,null,null,null,null,null,null,null,null,null,null,null,null,null,null,null,null,null,null,null,null,null,null,null,null,null,null,null,null,20,"130 kg N svin",1.3,{"$f":"DH25*$D$298*UdnytNsvin*0.01","v":104},{"$f":"DH25*$D$300","v":32.5},{"$f":"DH25*$D$302","v":65}]
[null,"Kornpris, forfrugtsværdi",null,115,null,"pr. hkg",null,null,null,null,null,null,null,null,null,null,null,null,null,null,null,null,null,null,null,null,null,null,null,null,null,null,null,null,null,null,null,null,null,null,null,null,null,null,null,null,null,null,null,null,null,null,null,null,null,null,null,null,null,null,null,null,null,null,null,null,null,null,null,null,null,null,null,null,null,null,null,null,null,null,null,null,null,null,null,null,null,null,null,null,null,null,null,null,null,null,null,null,null,null,null,null,null,null,null,null,null,null,null,21,"130 kg N kvæg",1.3,{"$f":"DH26*$D$304*UdnytNkvæg*0.01","v":97.5},{"$f":"DH26*$D$306","v":22.1},{"$f":"DH26*$D$308","v":87.100000000000009}]
[null,null,null,null,null,null,null,null,null,null,null,null,null,null,null,null,null,null,null,null,null,null,null,null,null,null,null,null,null,null,null,null,null,null,null,null,null,null,null,null,null,null,null,null,null,null,null,null,null,null,null,null,null,null,null,null,null,null,null,null,null,null,null,null,null,null,null,null,null,null,null,null,null,null,null,null,null,null,null,null,null,null,null,null,null,null,null,null,null,null,null,null,null,null,null,null,null,null,null,null,null,null,null,null,null,null,null,null,null,22,"140 kg N svin",1.4,{"$f":"DH27*$D$298*UdnytNsvin*0.01","v":112},{"$f":"DH27*$D$300","v":35},{"$f":"DH27*$D$302","v":70}]
[null,"Udnyttelse af N i svinegødning",null,80,null,"%",null,null,null,null,null,null,null,null,null,null,null,null,null,null,null,null,null,null,null,null,null,null,null,null,null,null,null,null,null,null,null,null,null,null,null,null,null,null,null,null,null,null,null,null,null,null,null,null,null,null,null,null,null,null,null,null,null,null,null,null,null,null,null,null,null,null,null,null,null,null,null,null,null,null,null,null,null,null,null,null,null,null,null,null,null,null,null,null,null,null,null,null,null,null,null,null,null,null,null,null,null,null,null,23,"140 kg N kvæg",1.4,{"$f":"DH28*$D$304*UdnytNkvæg*0.01","v":105},{"$f":"DH28*$D$306","v":23.799999999999997},{"$f":"DH28*$D$308","v":93.8}]
[null,null,null,null,null,null,null,null,null,null,null,null,null,null,null,null,null,null,null,null,null,null,null,null,null,null,null,null,null,null,null,null,null,null,null,null,null,null,null,null,null,null,null,null,null,null,null,null,null,null,null,null,null,null,null,null,null,null,null,null,null,null,null,null,null,null,null,null,null,null,null,null,null,null,null,null,null,null,null,null,null,null,null,null,null,null,null,null,null,null,null,null,null,null,null,null,null,null,null,null,null,null,null,null,null,null,null,null,null,24,"150 kg N svin",1.5,{"$f":"DH29*$D$298*UdnytNsvin*0.01","v":120},{"$f":"DH29*$D$300","v":37.5},{"$f":"DH29*$D$302","v":75}]
[null,"Udnyttelse af N i kvæggødning",null,75,null,"%",null,null,null,null,null,null,null,null,null,null,null,null,null,null,null,null,null,null,null,null,null,null,null,null,null,null,null,null,null,null,null,null,null,null,null,null,null,null,null,null,null,null,null,null,null,null,null,null,null,null,null,null,null,null,null,null,null,null,null,null,null,null,null,null,null,null,null,null,null,null,null,null,null,null,null,null,null,null,null,null,null,null,null,null,null,null,null,null,null,null,null,null,null,null,null,null,null,null,null,null,null,null,null,25,"150 kg N kvæg",1.5,{"$f":"DH30*$D$304*UdnytNkvæg*0.01","v":112.5},{"$f":"DH30*$D$306","v":25.5},{"$f":"DH30*$D$308","v":100.5}]
[null,null,null,null,null,null,null,null,null,null,null,null,null,null,null,null,null,null,null,null,null,null,null,null,null,null,null,null,null,null,null,null,null,null,null,null,null,null,null,null,null,null,null,null,null,null,null,null,null,null,null,null,null,null,null,null,null,null,null,null,null,null,null,null,null,null,null,null,null,null,null,null,null,null,null,null,null,null,null,null,null,null,null,null,null,null,null,null,null,null,null,null,null,null,null,null,null,null,null,null,null,null,null,null,null,null,null,null,null,26,"160 kg N svin",1.6,{"$f":"DH31*$D$298*UdnytNsvin*0.01","v":128},{"$f":"DH31*$D$300","v":40},{"$f":"DH31*$D$302","v":80}]
[null,"Halmpris",null,0.5,null,"kr. pr. kg",null,null,null,null,null,null,null,null,null,null,null,null,null,null,null,null,null,null,null,null,null,null,null,null,null,null,null,null,null,null,null,null,null,null,null,null,null,null,null,null,null,null,null,null,null,null,null,null,null,null,null,null,null,null,null,null,null,null,null,null,null,null,null,null,null,null,null,null,null,null,null,null,null,null,null,null,null,null,null,null,null,null,null,null,null,null,null,null,null,null,null,null,null,null,null,null,null,null,null,null,null,null,null,27,"160 kg N kvæg",1.6,{"$f":"DH32*$D$304*UdnytNkvæg*0.01","v":120},{"$f":"DH32*$D$306","v":27.200000000000003},{"$f":"DH32*$D$308","v":107.2}]
[null,null,null,null,null,null,null,null,null,null,null,null,null,null,null,null,null,null,null,null,null,null,null,null,null,null,null,null,null,null,null,null,null,null,null,null,null,null,null,null,null,null,null,null,null,null,null,null,null,null,null,null,null,null,null,null,null,null,null,null,null,null,null,null,null,null,null,null,null,null,null,null,null,null,null,null,null,null,null,null,null,null,null,null,null,null,null,null,null,null,null,null,null,null,null,null,null,null,null,null,null,null,null,null,null,null,null,null,null,28,"170 kg N svin",1.7,{"$f":"DH33*$D$298*UdnytNsvin*0.01","v":136},{"$f":"DH33*$D$300","v":42.5},{"$f":"DH33*$D$302","v":85}]
[null,"Årstal på udskrift",null,2021,null,null,null,null,null,null,null,null,null,null,null,null,null,null,null,null,null,null,null,null,null,null,null,null,null,null,null,null,null,null,null,null,null,null,null,null,null,null,null,null,null,null,null,null,null,null,null,null,null,null,null,null,null,null,null,null,null,null,null,null,null,null,null,null,null,null,null,null,null,null,null,null,null,null,null,null,null,null,null,null,null,null,null,null,null,null,null,null,null,null,null,null,null,null,null,null,null,null,null,null,null,null,null,null,null,29,"170 kg N kvæg",1.7,{"$f":"DH34*$D$304*UdnytNkvæg*0.01","v":127.5},{"$f":"DH34*$D$306","v":28.9},{"$f":"DH34*$D$308","v":113.89999999999999}]
[null,null,null,null,null,null,null,null,null,null,null,null,null,null,null,null,null,null,null,null,null,null,null,null,null,null,null,null,null,null,null,null,null,null,null,null,null,null,null,null,null,null,null,null,null,null,null,null,null,null,null,null,null,null,null,null,null,null,null,null,null,null,null,null,null,null,null,null,null,null,null,null,null,null,null,null,null,null,null,null,null,null,null,null,null,null,null,null,null,null,null,null,null,null,null,null,null,null,null,null,null,null,null,null,null,null,null,null,null,30,"180 kg N kvæg",1.8,{"$f":"DH35*$D$304*UdnytNkvæg*0.01","v":135},{"$f":"DH35*$D$306","v":30.6},{"$f":"DH35*$D$308","v":120.60000000000001}]
[null,null,null,null,null,null,null,null,null,null,null,null,null,null,null,null,null,null,null,null,null,null,null,null,null,null,null,null,null,null,null,null,null,null,null,null,null,null,null,null,null,null,null,null,null,null,null,null,null,null,null,null,null,null,null,null,null,null,null,null,null,null,null,null,null,null,null,null,null,null,null,null,null,null,null,null,null,null,null,null,null,null,null,null,null,null,null,null,null,null,null,null,null,null,null,null,null,null,null,null,null,null,null,null,null,null,null,null,null,31,"190 kg N kvæg",1.9,{"$f":"DH36*$D$304*UdnytNkvæg*0.01","v":142.5},{"$f":"DH36*$D$306","v":32.299999999999997},{"$f":"DH36*$D$308","v":127.3}]
[null,null,null,null,null,null,null,null,null,null,null,null,null,null,null,null,null,null,null,null,null,null,null,null,null,null,null,null,null,null,null,null,null,null,null,null,null,null,null,null,null,null,null,null,null,null,null,null,null,null,null,null,null,null,null,null,null,null,null,null,null,null,null,null,null,null,null,null,null,null,null,null,null,null,null,null,null,null,null,null,null,null,null,null,null,null,null,null,null,null,null,null,null,null,null,null,null,null,null,null,null,null,null,null,null,null,null,null,null,32,"200 kg N kvæg",2,{"$f":"DH37*$D$304*UdnytNkvæg*0.01","v":150},{"$f":"DH37*$D$306","v":34},{"$f":"DH37*$D$308","v":134}]
[null,null,null,null,null,null,null,null,null,null,null,null,null,null,null,null,null,null,null,null,null,null,null,null,null,null,null,null,null,null,null,null,null,null,null,null,null,null,null,null,null,null,null,null,null,null,null,null,null,null,null,null,null,null,null,null,null,null,null,null,null,null,null,null,null,null,null,null,null,null,null,null,null,null,null,null,null,null,null,null,null,null,null,null,null,null,null,null,null,null,null,null,null,null,null,null,null,null,null,null,null,null,null,null,null,null,null,null,null,33,"210 kg N kvæg",2.1,157.5,35.700000000000003,140.70000000000002]
[null,null,null,null,null,null,null,null,null,null,null,null,null,null,null,null,null,null,null,null,null,null,null,null,null,null,null,null,null,null,null,null,null,null,null,null,null,null,null,null,null,null,null,null,null,null,null,null,null,null,null,null,null,null,null,null,null,null,null,null,null,null,null,null,null,null,null,null,null,null,null,null,null,null,null,null,null,null,null,null,null,null,null,null,null,null,null,null,null,null,null,null,null,null,null,null,null,null,null,null,null,null,null,null,null,null,null,null,null,34,"220 kg N kvæg",2.2000000000000002,165.00000000000003,37.400000000000006,147.4]
[null,"Opret eventuelt egen afgrøde",null,null,null,null,null,null,null,null,null,null,null,null,null,null,null,null,"Her har du mulighed for at oprette egen afgrøde. Efter indtastningen af oplysningerne kan du vælge \"Anden afgrøde\" i rulleteksten under Sædskifte 1 og Sædskifte 2.",null,null,null,null,null,null,null,null,null,null,null,null,null,null,null,null,null,null,null,null,null,null,null,null,null,null,null,null,null,null,null,null,null,null,null,null,null,null,null,null,null,null,null,null,null,null,null,null,null,null,null,null,null,null,null,null,null,null,null,null,null,null,null,null,null,null,null,null,null,null,null,null,null,null,null,null,null,null,null,null,null,null,null,null,null,null,null,null,null,null,35,"230 kg N kvæg",2.2999999999999998,172.49999999999997,39.099999999999994,154.1]
[null,null,null,null,null,null,null,null,null,null,null,null,null,null,null,null,null,null,null,null,null,null,null,null,null,null,null,null,null,null,null,null,null,null,null,null,null,null,null,null,null,null,null,null,null,null,null,null,null,null,null,null,null,null,null,null,null,null,null,null,null,null,null,null,null,null,null,null,null,null,null,null,null,null,null,null,null,null,null,null,null,null,null,null,null,null,null,null,null,null,null,null,null,null,null,null,null,null,null,null,null,null,null,null,null,null,null,null,null,36,null,2.1,157.5,35.700000000000003,140.70000000000002]
[null,null,null,null,null,null,null,null,null,null,null,null,null,null,null,null,null,null,null,null,null,null,null,null,null,null,null,null,null,null,null,null,null,null,null,null,null,null,null,null,null,null,null,null,null,null,null,null,null,null,null,null,null,null,null,null,null,null,null,null,null,null,null,null,null,null,null,null,null,null,null,null,null,null,null,null,null,null,null,null,null,null,null,null,null,null,null,null,null,null,null,null,null,null,null,null,null,null,null,null,null,null,null,null,null,null,null,null,null,37,null,2.2000000000000002,165.00000000000003,37.400000000000006,147.4]
[null,"Indtast afgrødenavn",null,null,null,null,null,null,null,null,null,null,null,null,null,null,null,null,null,null,null,null,null,null,null,null,null,null,null,null,null,null,null,null,null,null,null,null,null,null,null,null,null,null,null,null,null,null,null,null,null,null,null,null,null,null,null,null,null,null,null,null,null,null,null,null,null,null,null,null,null,null,null,null,null,null,null,null,null,null,null,null,null,null,null,null,null,null,null,null,null,null,null,null,null,null,null,null,null,null,null,null,null,null,null,null,null,null,null,38,null,2.2999999999999998,172.49999999999997,39.099999999999994,154.1]
[]
[null,"Indtast forventet udbytte og pris",null,null,null,"Indtast stykomkostninger"]
[null,"Udbytte, hkg / ae pr. ha",null,null,null,"Udsæd, kr. pr ha",null,null,null,null,"Hvis N behovet dækkes med NPK 21-3-10, så svarer",null,null,null,null,{"$f":"IF(OR($I$46>0),\"Husk minus foran\",\"\")","v":""}]
[null,"Pris pr. hkg / ae",null,null,null,"Gødning beregnes ud fra mængde"]
[null,null,null,null,null,null,"N-behov, kg pr. ha",null,null,null,{"$f":"I48","v":0},"kg N til"]
[null,"Halmudbytte, kg pr. ha",null,null,null,null,"P-behov, kg pr. ha",null,null,null,"Kg P",{"$f":"K48/0.21*0.03","v":0}]
[null,null,null,null,null,null,"K-behov, kg pr. ha",null,null,null,"Kg K",{"$f":"K48/0.21*0.1","v":0}]
[null,null,null,null,null,"Planteværn",null,null,null,null,null,{"$f":"IF(OR($I$51>0),\"Husk minus foran\",\"\")","v":""}]
[null,null,null,null,null,"Diverse",null,null,null,null,null,{"$f":"IF(OR($I$52>0),\"Husk minus foran\",\"\")","v":""}]
[]
[null,"Beregning af forfrugtsværdi",null,null,null,"Indtast maskin- og arbejdsomkostninger"]
[null,"Forfrugtsværdi",null,"hkg pr. ha",null,"Maskiner og arbejde",null,null,null,"kr. pr. ha",null,{"$f":"IF(OR($I$55>0),\"Husk minus foran\",\"\")","v":""}]
[null,"Sparet N til næste afgrøde",null,"kg pr. ha",null,"Tørring",null,null,null,"kr. pr. hkg",null,{"$f":"IF(OR($I$56>0),\"Husk minus foran\",\"\")","v":""}]
[]
[]
[]
[]
[]
[]
[null,"Angiv sædskifte 1 og 2"]
[null,"Her kan du angive, hvilke afgrøder der skal indgå i sædskifte 1 samt arealer, udbytter og priser.\n"]
[null,"Sædskifte 1",null,"Antal",null,"Eget"," Udbytte-",null,"Egen",null,"Standard",null,null,null,null,null,null,null,"Her kan du angive, hvilke afgrøder der skal indgå i sædskifte 1 samt arealer, udbytter og priser.\nFor at få sædskifte 1 vist på udskriften skal det vælges i rullelisterne nedenfor til venstre."]
[null,null,null,"ha",null,"udbytte","norm",null,"pris",null," pris"]
[]
[null,null,null,null,null,null,{"$f":"IF(F68<>\"\",\"\",IF(VLOOKUP($CU159,_Afg07,$CV$5)=0,\"\",VLOOKUP($CU159,_Afg07,$CV$5)))","v":""},{"$f":"IF($CU159>1,IF(VLOOKUP($CU159,_Afg07,3)<>\"\",VLOOKUP($CU159,_Afg07,3),\"\"),\"\")","v":""},null,null,{"$f":"IF(I68<>\"\",\"\",IF(VLOOKUP($CU159,_Afg07,$U$285)=0,\"\",VLOOKUP($CU159,_Afg07,$U$285)))","v":""},{"$f":"IF($CU159>1,\"kr.\",\"\")","v":""},null,null,null,null,null,{"$f":"IF(AND(CU159>1,VLOOKUP(CU159,_Afg07,3)=\"\"),\"Areal med efterafgrøder tælles ikke med i dyrket areal i alt\",\"\")","v":""}]
[]
[null,null,null,null,null,null,{"$f":"IF(F70<>\"\",\"\",IF(VLOOKUP(CU161,_Afg07,$CV$5)=0,\"\",VLOOKUP(CU161,_Afg07,$CV$5)))","v":""},{"$f":"IF($CU161>1,IF(VLOOKUP($CU161,_Afg07,3)<>\"\",VLOOKUP($CU161,_Afg07,3),\"\"),\"\")","v":""},null,null,{"$f":"IF(I70<>\"\",\"\",IF(VLOOKUP($CU161,_Afg07,$U$285)=0,\"\",VLOOKUP($CU161,_Afg07,$U$285)))","v":""},{"$f":"IF($CU161>1,\"kr.\",\"\")","v":""},null,null,null,null,null,{"$f":"IF(AND(CU161>1,VLOOKUP(CU161,_Afg07,3)=\"\"),\"Areal med efterafgrøder tælles ikke med i dyrket areal i alt\",\"\")","v":""}]
[]
[null,null,null,null,null,null,{"$f":"IF(F72<>\"\",\"\",IF(VLOOKUP(CU163,_Afg07,$CV$5)=0,\"\",VLOOKUP(CU163,_Afg07,$CV$5)))","v":""},{"$f":"IF($CU163>1,IF(VLOOKUP($CU163,_Afg07,3)<>\"\",VLOOKUP($CU163,_Afg07,3),\"\"),\"\")","v":""},null,null,{"$f":"IF(I72<>\"\",\"\",IF(VLOOKUP($CU163,_Afg07,$U$285)=0,\"\",VLOOKUP($CU163,_Afg07,$U$285)))","v":""},{"$f":"IF($CU163>1,\"kr.\",\"\")","v":""},null,null,null,null,null,{"$f":"IF(AND(CU163>1,VLOOKUP(CU163,_Afg07,3)=\"\"),\"Areal med efterafgrøder tælles ikke med i dyrket areal i alt\",\"\")","v":""}]
[]
[null,null,null,null,null,null,{"$f":"IF(F74<>\"\",\"\",IF(VLOOKUP(CU165,_Afg07,$CV$5)=0,\"\",VLOOKUP(CU165,_Afg07,$CV$5)))","v":""},{"$f":"IF($CU165>1,IF(VLOOKUP($CU165,_Afg07,3)<>\"\",VLOOKUP($CU165,_Afg07,3),\"\"),\"\")","v":""},null,null,{"$f":"IF(I74<>\"\",\"\",IF(VLOOKUP($CU165,_Afg07,$U$285)=0,\"\",VLOOKUP($CU165,_Afg07,$U$285)))","v":""},{"$f":"IF($CU165>1,\"kr.\",\"\")","v":""},null,null,null,null,null,{"$f":"IF(AND(CU165>1,VLOOKUP(CU165,_Afg07,3)=\"\"),\"Areal med efterafgrøder tælles ikke med i dyrket areal i alt\",\"\")","v":""}]
[]
[null,null,null,null,null,null,{"$f":"IF(F76<>\"\",\"\",IF(VLOOKUP(CU167,_Afg07,$CV$5)=0,\"\",VLOOKUP(CU167,_Afg07,$CV$5)))","v":""},{"$f":"IF($CU167>1,IF(VLOOKUP($CU167,_Afg07,3)<>\"\",VLOOKUP($CU167,_Afg07,3),\"\"),\"\")","v":""},null,null,{"$f":"IF(I76<>\"\",\"\",IF(VLOOKUP($CU167,_Afg07,$U$285)=0,\"\",VLOOKUP($CU167,_Afg07,$U$285)))","v":""},{"$f":"IF($CU167>1,\"kr.\",\"\")","v":""},null,null,null,null,null,{"$f":"IF(AND(CU167>1,VLOOKUP(CU167,_Afg07,3)=\"\"),\"Areal med efterafgrøder tælles ikke med i dyrket areal i alt\",\"\")","v":""}]
[]
[null,null,null,null,null,null,{"$f":"IF(F78<>\"\",\"\",IF(VLOOKUP(CU169,_Afg07,$CV$5)=0,\"\",VLOOKUP(CU169,_Afg07,$CV$5)))","v":""},{"$f":"IF($CU169>1,IF(VLOOKUP($CU169,_Afg07,3)<>\"\",VLOOKUP($CU169,_Afg07,3),\"\"),\"\")","v":""},null,null,{"$f":"IF(I78<>\"\",\"\",IF(VLOOKUP($CU169,_Afg07,$U$285)=0,\"\",VLOOKUP($CU169,_Afg07,$U$285)))","v":""},{"$f":"IF($CU169>1,\"kr.\",\"\")","v":""},null,null,null,null,null,{"$f":"IF(AND(CU169>1,VLOOKUP(CU169,_Afg07,3)=\"\"),\"Areal med efterafgrøder tælles ikke med i dyrket areal i alt\",\"\")","v":""}]
[]
[null,null,null,null,null,null,{"$f":"IF(F80<>\"\",\"\",IF(VLOOKUP(CU171,_Afg07,$CV$5)=0,\"\",VLOOKUP(CU171,_Afg07,$CV$5)))","v":""},{"$f":"IF($CU171>1,IF(VLOOKUP($CU171,_Afg07,3)<>\"\",VLOOKUP($CU171,_Afg07,3),\"\"),\"\")","v":""},null,null,{"$f":"IF(I80<>\"\",\"\",IF(VLOOKUP($CU171,_Afg07,$U$285)=0,\"\",VLOOKUP($CU171,_Afg07,$U$285)))","v":""},{"$f":"IF($CU171>1,\"kr.\",\"\")","v":""},null,null,null,null,null,{"$f":"IF(AND(CU171>1,VLOOKUP(CU171,_Afg07,3)=\"\"),\"Areal med efterafgrøder tælles ikke med i dyrket areal i alt\",\"\")","v":""}]
[]
[null,"Dyrket areal i alt",null,{"$f":"IF(AND(CU159>1,VLOOKUP(CU159,_Afg07,3)<>\"\"),D68,0)+IF(AND(CU161>1,VLOOKUP(CU161,_Afg07,3)<>\"\"),D70,0)+IF(AND(CU163>1,VLOOKUP(CU163,_Afg07,3)<>\"\"),D72,0)+IF(AND(CU165>1,VLOOKUP(CU165,_Afg07,3)<>\"\"),D74,0)+IF(AND(CU167>1,VLOOKUP(CU167,_Afg07,3)<>\"\"),D76,0)+IF(AND(CU169>1,VLOOKUP(CU169,_Afg07,3)<>\"\"),D78,0)+IF(AND(CU171>1,VLOOKUP(CU171,_Afg07,3)<>\"\"),D80,0)","v":0}]
[]
[]
[null,"Her kan du angive, hvilke afgrøder der skal indgå i sædskifte 2 samt arealer, udbytter og priser.\n"]
[null,"Sædskifte 2",null,"Antal",null,"Eget"," Udbytte-",null,"Egen",null,"Standard",null,null,null,null,null,null,null,"Her kan du angive, hvilke afgrøder der skal indgå i sædskifte 2 samt arealer, udbytter og priser.\nFor at få sædskifte 2 vist på udskriften skal det vælges i rullelisterne nedenfor til venstre."]
[null,null,null,"ha",null,"udbytte","norm",null,"pris",null," pris"]
[]
[null,null,null,null,null,null,{"$f":"IF(F89<>\"\",\"\",IF(VLOOKUP(CU160,_Afg07,$CV$5)=0,\"\",VLOOKUP(CU160,_Afg07,$CV$5)))","v":""},{"$f":"IF(CU160>1,IF(VLOOKUP(CU160,_Afg07,3)<>\"\",VLOOKUP(CU160,_Afg07,3),\"\"),\"\")","v":""},null,null,{"$f":"IF(I89<>\"\",\"\",IF(VLOOKUP($CU160,_Afg07,$U$285)=0,\"\",VLOOKUP($CU160,_Afg07,$U$285)))","v":""},{"$f":"IF($CU160>1,\"kr.\",\"\")","v":""},null,null,null,null,null,{"$f":"IF(AND(CU160>1,VLOOKUP(CU160,_Afg07,3)=\"\"),\"Areal med efterafgrøder tælles ikke med i dyrket areal i alt\",\"\")","v":""}]
[]
[null,null,null,null,null,null,{"$f":"IF(F91<>\"\",\"\",IF(VLOOKUP(CU162,_Afg07,$CV$5)=0,\"\",VLOOKUP(CU162,_Afg07,$CV$5)))","v":""},{"$f":"IF(CU162>1,IF(VLOOKUP(CU162,_Afg07,3)<>\"\",VLOOKUP(CU162,_Afg07,3),\"\"),\"\")","v":""},null,null,{"$f":"IF(I91<>\"\",\"\",IF(VLOOKUP($CU162,_Afg07,$U$285)=0,\"\",VLOOKUP($CU162,_Afg07,$U$285)))","v":""},{"$f":"IF($CU162>1,\"kr.\",\"\")","v":""},null,null,null,null,null,{"$f":"IF(AND(CU162>1,VLOOKUP(CU162,_Afg07,3)=\"\"),\"Areal med efterafgrøder tælles ikke med i dyrket areal i alt\",\"\")","v":""}]
[]
[null,null,null,null,null,null,{"$f":"IF(F93<>\"\",\"\",IF(VLOOKUP(CU164,_Afg07,$CV$5)=0,\"\",VLOOKUP(CU164,_Afg07,$CV$5)))","v":""},{"$f":"IF(CU164>1,IF(VLOOKUP(CU164,_Afg07,3)<>\"\",VLOOKUP(CU164,_Afg07,3),\"\"),\"\")","v":""},null,null,{"$f":"IF(I93<>\"\",\"\",IF(VLOOKUP($CU164,_Afg07,$U$285)=0,\"\",VLOOKUP($CU164,_Afg07,$U$285)))","v":""},{"$f":"IF($CU164>1,\"kr.\",\"\")","v":""},null,null,null,null,null,{"$f":"IF(AND(CU164>1,VLOOKUP(CU164,_Afg07,3)=\"\"),\"Areal med efterafgrøder tælles ikke med i dyrket areal i alt\",\"\")","v":""}]
[]
[null,null,null,null,null,null,{"$f":"IF(F95<>\"\",\"\",IF(VLOOKUP(CU166,_Afg07,$CV$5)=0,\"\",VLOOKUP(CU166,_Afg07,$CV$5)))","v":""},{"$f":"IF(CU166>1,IF(VLOOKUP(CU166,_Afg07,3)<>\"\",VLOOKUP(CU166,_Afg07,3),\"\"),\"\")","v":""},null,null,{"$f":"IF(I95<>\"\",\"\",IF(VLOOKUP($CU166,_Afg07,$U$285)=0,\"\",VLOOKUP($CU166,_Afg07,$U$285)))","v":""},{"$f":"IF($CU166>1,\"kr.\",\"\")","v":""},null,null,null,null,null,{"$f":"IF(AND(CU166>1,VLOOKUP(CU166,_Afg07,3)=\"\"),\"Areal med efterafgrøder tælles ikke med i dyrket areal i alt\",\"\")","v":""}]
[]
[null,null,null,null,null,null,{"$f":"IF(F97<>\"\",\"\",IF(VLOOKUP(CU168,_Afg07,$CV$5)=0,\"\",VLOOKUP(CU168,_Afg07,$CV$5)))","v":""},{"$f":"IF(CU168>1,IF(VLOOKUP(CU168,_Afg07,3)<>\"\",VLOOKUP(CU168,_Afg07,3),\"\"),\"\")","v":""},null,null,{"$f":"IF(I97<>\"\",\"\",IF(VLOOKUP($CU168,_Afg07,$U$285)=0,\"\",VLOOKUP($CU168,_Afg07,$U$285)))","v":""},{"$f":"IF($CU168>1,\"kr.\",\"\")","v":""},null,null,null,null,null,{"$f":"IF(AND(CU168>1,VLOOKUP(CU168,_Afg07,3)=\"\"),\"Areal med efterafgrøder tælles ikke med i dyrket areal i alt\",\"\")","v":""}]
[]
[null,null,null,null,null,null,{"$f":"IF(F99<>\"\",\"\",IF(VLOOKUP(CU170,_Afg07,$CV$5)=0,\"\",VLOOKUP(CU170,_Afg07,$CV$5)))","v":""},{"$f":"IF(CU170>1,IF(VLOOKUP(CU170,_Afg07,3)<>\"\",VLOOKUP(CU170,_Afg07,3),\"\"),\"\")","v":""},null,null,{"$f":"IF(I99<>\"\",\"\",IF(VLOOKUP($CU170,_Afg07,$U$285)=0,\"\",VLOOKUP($CU170,_Afg07,$U$285)))","v":""},{"$f":"IF($CU170>1,\"kr.\",\"\")","v":""},null,null,null,null,null,{"$f":"IF(AND(CU170>1,VLOOKUP(CU170,_Afg07,3)=\"\"),\"Areal med efterafgrøder tælles ikke med i dyrket areal i alt\",\"\")","v":""}]
[]
[null,null,null,null,null,null,{"$f":"IF(F101<>\"\",\"\",IF(VLOOKUP(CU172,_Afg07,$CV$5)=0,\"\",VLOOKUP(CU172,_Afg07,$CV$5)))","v":""},{"$f":"IF(CU172>1,IF(VLOOKUP(CU172,_Afg07,3)<>\"\",VLOOKUP(CU172,_Afg07,3),\"\"),\"\")","v":""},null,null,{"$f":"IF(I101<>\"\",\"\",IF(VLOOKUP($CU172,_Afg07,$U$285)=0,\"\",VLOOKUP($CU172,_Afg07,$U$285)))","v":""},{"$f":"IF($CU172>1,\"kr.\",\"\")","v":""},null,null,null,null,null,{"$f":"IF(AND(CU172>1,VLOOKUP(CU172,_Afg07,3)=\"\"),\"Areal med efterafgrøder tælles ikke med i dyrket areal i alt\",\"\")","v":""}]
[]
[null,"Dyrket areal i alt",null,{"$f":"IF(AND(CU160>1,VLOOKUP(CU160,_Afg07,3)<>\"\"),D89,0)+IF(AND(CU162>1,VLOOKUP(CU162,_Afg07,3)<>\"\"),D91,0)+IF(AND(CU164>1,VLOOKUP(CU164,_Afg07,3)<>\"\"),D93,0)+IF(AND(CU166>1,VLOOKUP(CU166,_Afg07,3)<>\"\"),D95,0)+IF(AND(CU168>1,VLOOKUP(CU168,_Afg07,3)<>\"\"),D97,0)+IF(AND(CU170>1,VLOOKUP(CU170,_Afg07,3)<>\"\"),D99,0)+IF(AND(CU172>1,VLOOKUP(CU172,_Afg07,3)<>\"\"),D101,0)","v":0}]
[]
[]
[]
[]
[]
[]
[]
[]
[]
[]
[]
[]
[]
[]
[]
[]
[]
[]
[]
[]
[]
[]
[]
[]
[]
[]
[]
[]
[]
[]
[]
[]
[null,"Angiv afgrøder og sædskifter til sammenligning (Sædskifte 1 og 2 findes nederst i rullemenuer)"]
[null,null,null,"Afgrøde/sædskifte",null,null,null,"Alternativ 1",null,null,null,"Alternativ 2"]
[null,null,null,null,null,null,null,null,null,null,null,null,null,null,null,null,null,null,null,null,null,null,null,null,null,null,null,null,null,null,null,null,null,null,null,null,null,null,null,null,null,null,null,null,null,null,null,null,null,null,null,null,null,null,null,null,null,null,null,null,null,null,null,null,null,null,null,null,null,null,null,null,null,null,null,null,null,null,null,null,null,null,null,null,null,null,null,null,null,null,null,null,null,null,null,null,null,null,"Afgrøde","Alternat 1","Alternat 2","Alternat 3"]
[null,"Afgrøde",null,null,null,null,null,null,null,null,null,null,null,null,null,null,null,null,null,null,null,null,null,null,null,null,null,null,null,null,null,null,null,null,null,null,null,null,null,null,null,null,null,null,null,null,null,null,null,null,null,null,null,null,null,null,null,null,null,null,null,null,null,null,null,null,null,null,null,null,null,null,null,null,null,null,null,null,null,null,null,null,null,null,null,null,null,null,null,null,null,null,null,null,null,null,null,"Afgrøderækkenummer",1,1,1,1]
[null,null,null,{"$f":"IF(CU139=2,C43,\"\")","v":""},null,null,null,{"$f":"IF(CV139=2,C43,\"\")","v":""},null,null,null,{"$f":"IF(CW139=2,C43,\"\")","v":""}]
[null,"Udbyttenorm pr. ha",null,{"$f":"VLOOKUP(CU139,_Afg07,CV5)","v":0},{"$f":"IF($CU$139>1,IF(VLOOKUP($CU$139,_Afg07,3)=\"\",\"Hkg\",VLOOKUP($CU$139,_Afg07,3)),\"hkg\")","v":"hkg"},null,null,{"$f":"VLOOKUP(CV139,_Afg07,CV5)","v":0},{"$f":"IF($CV$139>1,IF(VLOOKUP($CV$139,_Afg07,3)=\"\",\"Hkg\",VLOOKUP($CV$139,_Afg07,3)),\"hkg\")","v":"hkg"},null,null,{"$f":"VLOOKUP(CW139,_Afg07,CV5)","v":0},{"$f":"IF($CW$139>1,IF(VLOOKUP($CW$139,_Afg07,3)=\"\",\"hkg\",VLOOKUP($CW$139,_Afg07,3)),\"hkg\")","v":"hkg"}]
[null,"Udbytte forventet",null,null,{"$f":"IF($CU$139>1,IF(VLOOKUP($CU$139,_Afg07,3)=\"\",\"Hkg\",VLOOKUP($CU$139,_Afg07,3)),\"hkg\")","v":"hkg"},null,null,null,{"$f":"IF($CV$139>1,IF(VLOOKUP($CV$139,_Afg07,3)=\"\",\"Hkg\",VLOOKUP($CV$139,_Afg07,3)),\"hkg\")","v":"hkg"},null,null,null,{"$f":"IF($CW$139>1,IF(VLOOKUP($CW$139,_Afg07,3)=\"\",\"hkg\",VLOOKUP($CW$139,_Afg07,3)),\"hkg\")","v":"hkg"}]
[]
[null,"Pris, standard pr. hkg",null,{"$f":"VLOOKUP(CU139,_Afg07,4)","v":0},"kr.",null,null,{"$f":"VLOOKUP(CV139,_Afg07,4)","v":0},"kr.",null,null,{"$f":"VLOOKUP(CW139,_Afg07,4)","v":0},"kr."]
[null,"Pris forventet",null,null,"kr.",null,null,null,"kr.",null,null,null,"kr."]
[]
[null,"Udskrift (side 1):"]
[]
[null,"Økonomi i afgrøder og sædskifter 2021"]
[]
[null,null,null,null,null,{"$f":"IF(CU139>1,VLOOKUP(CU139,_Afg07,2),\"\")","v":""},null,null,{"$f":"IF(CV139>1,VLOOKUP(CV139,_Afg07,2),\"\")","v":""},null,null,null,{"$f":"IF(CW139>1,VLOOKUP(CW139,_Afg07,2),\"\")","v":""},null,null,null,null,null,null,null,null,null,null,null,null,null,null,null,null,null,null,null,null,null,null,null,null,null,null,null,null,null,null,null,null,null,null,null,null,null,null,null,null,null,null,null,null,null,null,null,null,null,null,null,null,null,null,null,null,null,null,null,null,null,null,null,null,null,null,null,null,null,null,null,null,null,null,null,null,null,"Efterafgr. Olieræddike"]
[null,"Udbytte pr. ha",null,{"$f":"IF(CU139>1,IF(D142=\"\",D141,D142),\"\")","v":""},{"$f":"IF(AND(D152<>\"\",D152>0),VLOOKUP(CU139,_Afg07,3),\"\")","v":""},null,null,{"$f":"IF(CV139>1,IF(H142=\"\",H141,H142),\"\")","v":""},{"$f":"IF(AND(H152<>\"\",H152>0),VLOOKUP(CV139,_Afg07,3),\"\")","v":""},null,null,{"$f":"IF(CW139>1,IF(L142=\"\",L141,L142),\"\")","v":""},{"$f":"IF(AND(L152<>\"\",L152>0),VLOOKUP(CW139,_Afg07,3),\"\")","v":""},null,null,null,null,null,"I nedenstående felter kan du overskrive gennemsnitsværdier i økonomiberegning, kr. pr. ha",null,null,null,null,null,null,null,null,null,null,null,null,null,null,null,null,null,null,null,null,null,null,null,null,null,null,null,null,null,null,null,null,null,null,null,null,null,null,null,null,null,null,null,null,null,null,null,null,null,null,null,null,null,null,null,null,null,null,null,null,null,null,null,null,null,null,null,null,null,null,null,"Efterafgr. Rajgræs"]
[null,"Pris pr. hkg",null,{"$f":"IF(CU139>1,IF(D145=\"\",D144,D145),\"\")","v":""},{"$f":"IF(D153<>\"\",\"kr.\",\"\")","v":""},null,null,{"$f":"IF(CV139>1,IF(H145=\"\",H144,H145),\"\")","v":""},{"$f":"IF(H153<>\"\",\"kr.\",\"\")","v":""},null,null,{"$f":"IF(CW139>1,IF(L145=\"\",L144,L145),\"\")","v":""},{"$f":"IF(L153<>\"\",\"kr.\",\"\")","v":""},null,null,null,null,null,"Husk minus foran omkostninger.",null,null,null,null,null,null,null,null,null,null,null,null,null,null,null,null,null,null,null,null,null,null,null,null,null,null,null,null,null,null,null,null,null,null,null,null,null,null,null,null,null,null,null,null,null,null,null,null,null,null,null,null,null,null,null,null,null,null,null,null,null,null,null,null,null,null,null,null,null,null,null,"Efterafgr. Gul sennep",null,null,null,null,null,null,null,null,null,null,null,null,null,null,null,null,null,null,null,null,null,null,null,null,null,null,"Plov (Plo)",null,"Stubharve (Stu)",null,"Såbedsharve (Såb)",null,"Marksprøjte ",null,"Såmaskine (Såm)",null,"Mejetærsker (Mej)",null,"Halmpresser (Hal)",null,"Gylleudbringning",null,"Gødningsspreder",null,"Enkornsåmaskine",null,"Kartoffellægger",null,"Kartoffeloptager",null,"Roeoptager"]
[null,null,null,null,null,null,null,null,null,null,null,null,null,null,null,null,null,null,"Husk at slette tallene igen før ny beregning."]
[null,"Udbytte, kerne/frø",null,{"$f":"IF(CU139>1,D152*D153,\"\")","v":""},{"$f":"IF(D155<>\"\",\"kr.\",\"\")","v":""},null,null,{"$f":"IF(CV139>1,H152*H153,\"\")","v":""},{"$f":"IF(H155<>\"\",\"kr.\",\"\")","v":""},null,null,{"$f":"IF(CW139>1,L152*L153,\"\")","v":""},{"$f":"IF(L155<>\"\",\"kr.\",\"\")","v":""},null,null,null,null,null,null,null,null,null,null,null,null,null,null,null,null,null,null,null,null,null,null,null,null,null,null,null,null,null,null,null,null,null,null,null,null,null,null,null,null,null,null,null,null,null,null,null,null,null,null,null,null,null,null,null,null,null,null,null,null,null,null,null,null,null,null,null,null,null,null,null,null,null,null,null,null,null,null,null,null,null,null,null,null,null,null,null,null,null,null,null,null,null,null,null,null,null,null,null,null,null,null,null,null,3,null,2,null,2,null,1,null,2,null,2,null,2,null,2,null,2,null,1,null,2,null,1,null,1]
[null,"Udbytte, halm",null,{"$f":"IF(CU139>1,IF($CU$7=1,VLOOKUP(CU139,_Afg07,$CV$7,0)*Halmpris,\"\"),\"\")","v":""},{"$f":"IF(D156<>\"\",\"kr.\",\"\")","v":""},null,null,{"$f":"IF(CV139>1,IF($CU$7=1,VLOOKUP(CV139,_Afg07,$CV$7,0)*Halmpris,\"\"),\"\")","v":""},{"$f":"IF(H156<>\"\",\"kr.\",\"\")","v":""},null,null,{"$f":"IF(CW139>1,IF($CU$7=1,VLOOKUP(CW139,_Afg07,$CV$7,0)*Halmpris,\"\"),\"\")","v":""},{"$f":"IF(L156<>\"\",\"kr.\",\"\")","v":""},null,null,null,null,null,null,"Afgrøde/",null,"Alternativ 1",null,"Alternativ 2",null,null,null,null,null,null,null,null,null,null,null,null,null,null,null,null,null,null,null,null,null,null,null,null,null,null,null,null,null,null,null,null,null,null,null,null,null,null,null,null,null,null,null,null,null,null,null,null,null,null,null,null,null,null,null,null,null,null,null,null,null,null,null,null,null,null,null,null,null,null,null,null,null,null,null,null,null,null,null,null,null,null,null,null,null,null,null,null,null,null,null,null,null,null,null,null,null,null,null,null,null,"Timer i alt"]
[null,"Forfrugtsværdi",null,{"$f":"IF(CU139>1,IF($CU$13=1,(VLOOKUP(CU139,_Afg07,$CV$13)*ffvpris+VLOOKUP(CU139,_Afg07,20)*Npris),0),\"\")","v":""},{"$f":"IF(D157<>\"\",\"kr.\",\"\")","v":""},null,null,{"$f":"IF(CV139>1,IF($CU$13=1,(VLOOKUP(CV139,_Afg07,$CV$13)*ffvpris+VLOOKUP(CV139,_Afg07,20)*Npris),0),\"\")","v":""},{"$f":"IF(H157<>\"\",\"kr.\",\"\")","v":""},null,null,{"$f":"IF(CW139>1,IF($CU$13=1,(VLOOKUP(CW139,_Afg07,$CV$13)*ffvpris+VLOOKUP(CW139,_Afg07,20)*Npris),0),\"\")","v":""},{"$f":"IF(L157<>\"\",\"kr.\",\"\")","v":""},null,null,null,null,null,null,"sædskifte",null,null,null,null,null,null,null,null,null,null,null,null,null,null,null,null,null,null,null,null,null,null,null,null,null,null,null,null,null,null,null,null,null,null,null,null,null,null,null,null,null,null,null,null,null,null,null,null,null,null,null,null,null,null,null,null,null,null,null,null,null,null,null,null,null,null,null,null,null,"Kagediagram 1",null,null,null,null,null,"Kagediagram Lopslag",null,null,null,null,"Erstatningskorn,sædskifte","Udbytte, foderkorn","Areal, foderkorn",null,null,"Halm fra foderkorn",null,"Hovedafgrøde_areal",null,null,null,null,null,null,null,null,null,"Pløjning",null,"Harvning efter høst",null,"Såbedsharvning",null,"Glyphosatsprøjtning",null,"Pløjning vinter/forå","Pløjning august","Pløjning sept","Harvning e høst juli","Harvning e høst august","Harvning e høst oktober","Såbedsharvn forår","Såbedsharvn august","Såbedsharvn september","Glyphosat forår","Glyphosat august","Glyphosat september","Såning forår","Såning august","Såning september","Høst juli","Høst august","Høst oktober","Halm juli","Halm august","Enkornsåning forår","Kartof lægning forår","Kartof optag sept","Roeoptag","Planteværn","Gødning","Gylle"]
[null,"Tilskud",null,{"$f":"IF(T158<>\"\",T158,\"\")","v":""},{"$f":"IF(D158<>\"\",\"kr.\",\"\")","v":""},null,null,{"$f":"IF(V158<>\"\",V158,\"\")","v":""},{"$f":"IF(H158<>\"\",\"kr.\",\"\")","v":""},null,null,{"$f":"IF(X158<>\"\",X158,\"\")","v":""},{"$f":"IF(L158<>\"\",\"kr.\",\"\")","v":""},null,null,null,null,null,"Tilskud",null,null,null,null,null,null,null,null,null,null,null,null,null,null,null,null,null,null,null,null,null,null,null,null,null,null,null,null,null,null,null,null,null,null,null,null,null,null,null,null,null,null,null,null,null,null,null,null,null,null,null,null,null,null,null,null,null,null,null,null,null,null,null,null,null,null,null,null,null,null,{"$f":"IF(CM158=0,\"\",_xlfn.CONCAT(CM158,\" \",\"(\",CO158,\"ha\",\")\"))","v":""},{"$f":"IF(CN158=\"Egen afgrøde\",$C$43,CN158)","v":0},{"$f":"IF(CR158=$CM$151,0,IF(CR158=$CM$152,0,IF(CR158=$CM$153,0,CR158)))","v":0},{"$f":"IF(CR158=$CM$151,0,IF(CR158=$CM$152,0,IF(CR158=$CM$153,0,CS158)))","v":0},null,null,{"$f":"VLOOKUP(CU159,$R$288:$S$342,2)","v":0},{"$f":"D68","v":0}]
[null,"Bruttoudbytte i alt",null,{"$f":"IF(CU139>1,SUM(D155:D158),\"\")","v":""},{"$f":"IF(D159<>\"\",\"kr.\",\"\")","v":""},null,null,{"$f":"IF(CV139>1,SUM(H155:H158),\"\")","v":""},{"$f":"IF(H159<>\"\",\"kr.\",\"\")","v":""},null,null,{"$f":"IF(CW139>1,SUM(L155:L158),\"\")","v":""},{"$f":"IF(L159<>\"\",\"kr.\",\"\")","v":""},null,null,null,null,null,null,null,null,null,null,null,null,null,null,null,null,null,null,null,null,null,null,null,null,null,null,null,null,null,null,null,null,null,null,null,null,null,null,null,null,null,null,null,null,null,null,null,null,null,null,null,null,null,null,null,null,null,null,null,null,null,null,null,null,null,null,null,null,null,null,null,null,null,null,null,null,{"$f":"IF(CM159=0,\"\",_xlfn.CONCAT(CM159,\" \",\"(\",CO159,\"ha\",\")\"))","v":""},{"$f":"IF(CN159=\"Egen afgrøde\",$C$43,CN159)","v":0},{"$f":"IF(CR159=$CM$151,0,IF(CR159=$CM$152,0,IF(CR159=$CM$153,0,CR159)))","v":0},{"$f":"IF(CR159=$CM$151,0,IF(CR159=$CM$152,0,IF(CR159=$CM$153,0,CS159)))","v":0},null,null,{"$f":"VLOOKUP(CU161,$R$288:$S$342,2)","v":0},{"$f":"D70","v":0},null,1,null,{"$f":"IF(CU159>1,IF(VLOOKUP(CU159,_Afg07,$BU$285)=2,IF($CU$9=2,-VLOOKUP($R$324,_Afg07,$CV$9)*Erstatpris*D68,0),0),0)","v":0},{"$f":"IF(AND(CU159>1,VLOOKUP(CU159,_Afg07,$BU$285)=1),IF(F68<>\"\",F68,G68)*D68,0)","v":0},{"$f":"IF(AND(CU159>1,VLOOKUP(CU159,_Afg07,$BU$285)=1),D68,0)","v":0},null,null,{"$f":"IF(AND(CU159>1,VLOOKUP(CU159,_Afg07,$BU$285)=1),VLOOKUP(CU159,_Afg07,Halmnr)*D68,0)","v":0},null,null,null,null,null,null,null,null,null,null,null,true,null,false,null,true,null,false,null,{"$f":"IF(VLOOKUP($CU159,_Afg07,$BV$285)=1,IF($DN159,$D68/IF(_Plo2<>\"\",_Plo2,Plo),0),0)","v":0},{"$f":"IF(VLOOKUP($CU159,_Afg07,$BV$285)=2,IF($DN159,$D68/IF(_Plo2<>\"\",_Plo2,Plo),0),0)","v":0},{"$f":"IF(VLOOKUP($CU159,_Afg07,$BV$285)=3,IF($DN159,$D68/IF(_Plo2<>\"\",_Plo2,Plo),0),0)","v":0},{"$f":"IF(VLOOKUP($CU159,_Afg07,$BZ$285)=1,IF($DP159,$D68/IF(_Stu2<>\"\",_Stu2,Stu),0),0)","v":0},{"$f":"IF(VLOOKUP($CU159,_Afg07,$BZ$285)=2,IF($DP159,$D68/IF(_Stu2<>\"\",_Stu2,Stu),0),0)","v":0},{"$f":"IF(VLOOKUP($CU159,_Afg07,$BZ$285)=3,IF($DP159,$D68/IF(_Stu2<>\"\",_Stu2,Stu),0),0)","v":0},{"$f":"IF(VLOOKUP($CU159,_Afg07,$BW$285)=1,IF($DR159,$D68/IF(Såb2<>\"\",Såb2,Såb),0),0)","v":0},{"$f":"IF(VLOOKUP($CU159,_Afg07,$BW$285)=2,IF($DR159,$D68/IF(Såb2<>\"\",Såb2,Såb),0),0)","v":0},{"$f":"IF(VLOOKUP($CU159,_Afg07,$BW$285)=3,IF($DR159,$D68/IF(Såb2<>\"\",Såb2,Såb),0),0)","v":0},{"$f":"IF(VLOOKUP($CU159,_Afg07,$BX$285)=1,IF($DT159,$D68/IF(_Gly2<>\"\",_Gly2,Gly),0),0)","v":0},{"$f":"IF(VLOOKUP($CU159,_Afg07,$BX$285)=2,IF($DT159,$D68/IF(_Gly2<>\"\",_Gly2,Gly),0),0)","v":0},{"$f":"IF(VLOOKUP($CU159,_Afg07,$BX$285)=3,IF($DT159,$D68/IF(_Gly2<>\"\",_Gly2,Gly),0),0)","v":0},{"$f":"IF(VLOOKUP($CU159,_Afg07,$BY$285)=1,$D68/IF(Såm2<>\"\",Såm2,Såm),0)","v":0},{"$f":"IF(VLOOKUP($CU159,_Afg07,$BY$285)=2,$D68/IF(Såm2<>\"\",Såm2,Såm),0)","v":0},{"$f":"IF(VLOOKUP($CU159,_Afg07,$BY$285)=3,$D68/IF(Såm2<>\"\",Såm2,Såm),0)","v":0},{"$f":"IF(VLOOKUP($CU159,_Afg07,$CA$285)=1,$D68/IF(_Mej2<>\"\",_Mej2,Mej)*VLOOKUP($CU159,_Afg07,$CC$285),0)","v":0},{"$f":"IF(VLOOKUP($CU159,_Afg07,$CA$285)=2,$D68/IF(_Mej2<>\"\",_Mej2,Mej)*VLOOKUP($CU159,_Afg07,$CC$285),0)","v":0},{"$f":"IF(VLOOKUP($CU159,_Afg07,$CA$285)=3,$D68/IF(_Mej2<>\"\",_Mej2,Mej)*VLOOKUP($CU159,_Afg07,$CC$285),0)","v":0},{"$f":"IF(HalmJa=1,IF(VLOOKUP($CU159,_Afg07,$CB$285)=1,$D68/IF(_Hal3<>\"\",_Hal3,Hal)+$D68/_Hal2,0),0)","v":0},{"$f":"IF(HalmJa=1,IF(VLOOKUP($CU159,_Afg07,$CB$285)=2,$D68/IF(_Hal3<>\"\",_Hal3,Hal)+$D68/_Hal2,0),0)","v":0},{"$f":"IF(VLOOKUP($CU159,_Afg07,$CD$285)=1,$D68/IF(_Enk2<>\"\",_Enk2,Enk),0)","v":0},{"$f":"IF(VLOOKUP($CU159,_Afg07,$CE$285)=1,$D68/IF(_Kar2<>\"\",_Kar2,Kar),0)","v":0},{"$f":"IF(VLOOKUP($CU159,_Afg07,$CF$285)=1,$D68/IF(Kopt2<>\"\",Kopt2,Kopt),0)","v":0},{"$f":"IF(VLOOKUP($CU159,_Afg07,$CG$285)=1,$D68/IF(Ropt2<>\"\",Ropt2,Ropt),0)","v":0},{"$f":"VLOOKUP($CU159,_Afg07,$CH$285)*$D68/IF(_Gly2<>\"\",_Gly2,Gly)","v":0},{"$f":"VLOOKUP($CU159,_Afg07,$CI$285)*$D68/IF(Gød2<>\"\",Gød2,Gød)","v":0}]
[null,null,null,null,null,null,null,null,null,null,null,null,null,null,null,null,null,null,null,null,null,null,null,null,null,null,null,null,null,null,null,null,null,null,null,null,null,null,null,null,null,null,null,null,null,null,null,null,null,null,null,null,null,null,null,null,null,null,null,null,null,null,null,null,null,null,null,null,null,null,null,null,null,null,null,null,null,null,null,null,null,null,null,null,null,null,null,null,null,"",{"$f":"IF(CN160=\"Egen afgrøde\",$C$43,CN160)","v":0},0,0,null,null,{"$f":"VLOOKUP(CU163,$R$288:$S$342,2)","v":0},{"$f":"D72","v":0},null,1,null,{"$f":"IF(CU160>1,IF(VLOOKUP(CU160,_Afg07,$BU$285)=2,IF($CU$9=2,-VLOOKUP($R$324,_Afg07,$CV$9)*Erstatpris*D89,0),0),0)","v":0},{"$f":"IF(AND(CU160>1,VLOOKUP(CU160,_Afg07,$BU$285)=1),IF(F89<>\"\",F89,G89)*D89,0)","v":0},{"$f":"IF(AND(CU160>1,VLOOKUP(CU160,_Afg07,$BU$285)=1),D89,0)","v":0},null,null,{"$f":"IF(AND(CU160>1,VLOOKUP(CU160,_Afg07,$BU$285)=1),VLOOKUP(CU160,_Afg07,Halmnr)*D89,0)","v":0},null,null,null,null,null,null,null,null,null,null,null,true,null,false,null,true,null,false,null,{"$f":"IF(VLOOKUP($CU160,_Afg07,$BV$285)=1,IF($DN160,$D89/IF(_Plo2<>\"\",_Plo2,Plo),0),0)","v":0},{"$f":"IF(VLOOKUP($CU160,_Afg07,$BV$285)=2,IF($DN160,$D89/IF(_Plo2<>\"\",_Plo2,Plo),0),0)","v":0},{"$f":"IF(VLOOKUP($CU160,_Afg07,$BV$285)=3,IF($DN160,$D89/IF(_Plo2<>\"\",_Plo2,Plo),0),0)","v":0},{"$f":"IF(VLOOKUP($CU160,_Afg07,$BZ$285)=1,IF($DP160,$D89/IF(_Stu2<>\"\",_Stu2,Stu),0),0)","v":0},{"$f":"IF(VLOOKUP($CU160,_Afg07,$BZ$285)=2,IF($DP160,$D89/IF(_Stu2<>\"\",_Stu2,Stu),0),0)","v":0},{"$f":"IF(VLOOKUP($CU160,_Afg07,$BZ$285)=3,IF($DP160,$D89/IF(_Stu2<>\"\",_Stu2,Stu),0),0)","v":0},{"$f":"IF(VLOOKUP($CU160,_Afg07,$BW$285)=1,IF($DR160,$D89/IF(Såb2<>\"\",Såb2,Såb),0),0)","v":0},{"$f":"IF(VLOOKUP($CU160,_Afg07,$BW$285)=2,IF($DR160,$D89/IF(Såb2<>\"\",Såb2,Såb),0),0)","v":0},{"$f":"IF(VLOOKUP($CU160,_Afg07,$BW$285)=3,IF($DR160,$D89/IF(Såb2<>\"\",Såb2,Såb),0),0)","v":0},{"$f":"IF(VLOOKUP($CU160,_Afg07,$BX$285)=1,IF($DT160,$D89/IF(_Gly2<>\"\",_Gly2,Gly),0),0)","v":0},{"$f":"IF(VLOOKUP($CU160,_Afg07,$BX$285)=2,IF($DT160,$D89/IF(_Gly2<>\"\",_Gly2,Gly),0),0)","v":0},{"$f":"IF(VLOOKUP($CU160,_Afg07,$BX$285)=3,IF($DT160,$D89/IF(_Gly2<>\"\",_Gly2,Gly),0),0)","v":0},{"$f":"IF(VLOOKUP($CU160,_Afg07,$BY$285)=1,$D89/IF(Såm2<>\"\",Såm2,Såm),0)","v":0},{"$f":"IF(VLOOKUP($CU160,_Afg07,$BY$285)=2,$D89/IF(Såm2<>\"\",Såm2,Såm),0)","v":0},{"$f":"IF(VLOOKUP($CU160,_Afg07,$BY$285)=3,$D89/IF(Såm2<>\"\",Såm2,Såm),0)","v":0},{"$f":"IF(VLOOKUP($CU160,_Afg07,$CA$285)=1,$D89/IF(_Mej2<>\"\",_Mej2,Mej)*VLOOKUP($CU160,_Afg07,$CC$285),0)","v":0},{"$f":"IF(VLOOKUP($CU160,_Afg07,$CA$285)=2,$D89/IF(_Mej2<>\"\",_Mej2,Mej)*VLOOKUP($CU160,_Afg07,$CC$285),0)","v":0},{"$f":"IF(VLOOKUP($CU160,_Afg07,$CA$285)=3,$D89/IF(_Mej2<>\"\",_Mej2,Mej)*VLOOKUP($CU160,_Afg07,$CC$285),0)","v":0},{"$f":"IF(HalmJa=1,IF(VLOOKUP($CU160,_Afg07,$CB$285)=1,$D89/IF(_Hal3<>\"\",_Hal3,Hal)+$D89/_Hal2,0),0)","v":0},{"$f":"IF(HalmJa=1,IF(VLOOKUP($CU160,_Afg07,$CB$285)=2,$D89/IF(_Hal3<>\"\",_Hal3,Hal)+$D89/_Hal2,0),0)","v":0},{"$f":"IF(VLOOKUP($CU160,_Afg07,$CD$285)=1,$D89/IF(_Enk2<>\"\",_Enk2,Enk),0)","v":0},{"$f":"IF(VLOOKUP($CU160,_Afg07,$CE$285)=1,$D89/IF(_Kar2<>\"\",_Kar2,Kar),0)","v":0},{"$f":"IF(VLOOKUP($CU160,_Afg07,$CF$285)=1,$D89/IF(Kopt2<>\"\",Kopt2,Kopt),0)","v":0},{"$f":"IF(VLOOKUP($CU160,_Afg07,$CG$285)=1,$D89/IF(Ropt2<>\"\",Ropt2,Ropt),0)","v":0},{"$f":"VLOOKUP($CU160,_Afg07,$CH$285)*$D89/IF(_Gly2<>\"\",_Gly2,Gly)","v":0},{"$f":"VLOOKUP($CU160,_Afg07,$CI$285)*$D89/IF(Gød2<>\"\",Gød2,Gød)","v":0}]
[null,"Udsæd",null,{"$f":"IF(CU139>1,IF(T161<>\"\",T161,-VLOOKUP(CU139,_Afg07,AL285)),\"\")","v":""},{"$f":"IF(D161<>\"\",\"kr.\",\"\")","v":""},null,null,{"$f":"IF(CV139>1,IF(V161<>\"\",V161,-VLOOKUP(CV139,_Afg07,AL285)),\"\")","v":""},{"$f":"IF(H161<>\"\",\"kr.\",\"\")","v":""},null,null,{"$f":"IF(CW139>1,IF(X161<>\"\",X161,-VLOOKUP(CW139,_Afg07,AL285)),\"\")","v":""},{"$f":"IF(L161<>\"\",\"kr.\",\"\")","v":""},null,null,null,null,null,"Udsæd",null,null,null,null,null,null,null,null,null,null,null,null,null,null,null,null,null,null,null,null,null,null,null,null,null,null,null,null,null,null,null,null,null,null,null,null,null,null,null,null,null,null,null,null,null,null,null,null,null,null,null,null,null,null,null,null,null,null,null,null,null,null,null,null,null,null,null,null,null,null,"",{"$f":"IF(CN161=\"Egen afgrøde\",$C$43,CN161)","v":0},0,0,null,null,{"$f":"VLOOKUP(CU165,$R$288:$S$342,2)","v":0},{"$f":"D74","v":0},null,1,null,{"$f":"IF(CU161>1,IF(VLOOKUP(CU161,_Afg07,$BU$285)=2,IF($CU$9=2,-VLOOKUP($R$324,_Afg07,$CV$9)*Erstatpris*D70,0),0),0)","v":0},{"$f":"IF(AND(CU161>1,VLOOKUP(CU161,_Afg07,$BU$285)=1),IF(F70<>\"\",F70,G70)*D70,0)","v":0},{"$f":"IF(AND(CU161>1,VLOOKUP(CU161,_Afg07,$BU$285)=1),D70,0)","v":0},null,null,{"$f":"IF(AND(CU161>1,VLOOKUP(CU161,_Afg07,$BU$285)=1),VLOOKUP(CU161,_Afg07,Halmnr)*D70,0)","v":0},null,null,null,null,null,null,null,null,null,null,null,true,null,false,null,true,null,false,null,{"$f":"IF(VLOOKUP($CU161,_Afg07,$BV$285)=1,IF($DN161,$D70/IF(_Plo2<>\"\",_Plo2,Plo),0),0)","v":0},{"$f":"IF(VLOOKUP($CU161,_Afg07,$BV$285)=2,IF($DN161,$D70/IF(_Plo2<>\"\",_Plo2,Plo),0),0)","v":0},{"$f":"IF(VLOOKUP($CU161,_Afg07,$BV$285)=3,IF($DN161,$D70/IF(_Plo2<>\"\",_Plo2,Plo),0),0)","v":0},{"$f":"IF(VLOOKUP($CU161,_Afg07,$BZ$285)=1,IF($DP161,$D70/IF(_Stu2<>\"\",_Stu2,Stu),0),0)","v":0},{"$f":"IF(VLOOKUP($CU161,_Afg07,$BZ$285)=2,IF($DP161,$D70/IF(_Stu2<>\"\",_Stu2,Stu),0),0)","v":0},{"$f":"IF(VLOOKUP($CU161,_Afg07,$BZ$285)=3,IF($DP161,$D70/IF(_Stu2<>\"\",_Stu2,Stu),0),0)","v":0},{"$f":"IF(VLOOKUP($CU161,_Afg07,$BW$285)=1,IF($DR161,$D70/IF(Såb2<>\"\",Såb2,Såb),0),0)","v":0},{"$f":"IF(VLOOKUP($CU161,_Afg07,$BW$285)=2,IF($DR161,$D70/IF(Såb2<>\"\",Såb2,Såb),0),0)","v":0},{"$f":"IF(VLOOKUP($CU161,_Afg07,$BW$285)=3,IF($DR161,$D70/IF(Såb2<>\"\",Såb2,Såb),0),0)","v":0},{"$f":"IF(VLOOKUP($CU161,_Afg07,$BX$285)=1,IF($DT161,$D70/IF(_Gly2<>\"\",_Gly2,Gly),0),0)","v":0},{"$f":"IF(VLOOKUP($CU161,_Afg07,$BX$285)=2,IF($DT161,$D70/IF(_Gly2<>\"\",_Gly2,Gly),0),0)","v":0},{"$f":"IF(VLOOKUP($CU161,_Afg07,$BX$285)=3,IF($DT161,$D70/IF(_Gly2<>\"\",_Gly2,Gly),0),0)","v":0},{"$f":"IF(VLOOKUP($CU161,_Afg07,$BY$285)=1,$D70/IF(Såm2<>\"\",Såm2,Såm),0)","v":0},{"$f":"IF(VLOOKUP($CU161,_Afg07,$BY$285)=2,$D70/IF(Såm2<>\"\",Såm2,Såm),0)","v":0},{"$f":"IF(VLOOKUP($CU161,_Afg07,$BY$285)=3,$D70/IF(Såm2<>\"\",Såm2,Såm),0)","v":0},{"$f":"IF(VLOOKUP($CU161,_Afg07,$CA$285)=1,$D70/IF(_Mej2<>\"\",_Mej2,Mej)*VLOOKUP($CU161,_Afg07,$CC$285),0)","v":0},{"$f":"IF(VLOOKUP($CU161,_Afg07,$CA$285)=2,$D70/IF(_Mej2<>\"\",_Mej2,Mej)*VLOOKUP($CU161,_Afg07,$CC$285),0)","v":0},{"$f":"IF(VLOOKUP($CU161,_Afg07,$CA$285)=3,$D70/IF(_Mej2<>\"\",_Mej2,Mej)*VLOOKUP($CU161,_Afg07,$CC$285),0)","v":0},{"$f":"IF(HalmJa=1,IF(VLOOKUP($CU161,_Afg07,$CB$285)=1,$D70/IF(_Hal3<>\"\",_Hal3,Hal)+$D70/_Hal2,0),0)","v":0},{"$f":"IF(HalmJa=1,IF(VLOOKUP($CU161,_Afg07,$CB$285)=2,$D70/IF(_Hal3<>\"\",_Hal3,Hal)+$D70/_Hal2,0),0)","v":0},{"$f":"IF(VLOOKUP($CU161,_Afg07,$CD$285)=1,$D70/IF(_Enk2<>\"\",_Enk2,Enk),0)","v":0},{"$f":"IF(VLOOKUP($CU161,_Afg07,$CE$285)=1,$D70/IF(_Kar2<>\"\",_Kar2,Kar),0)","v":0},{"$f":"IF(VLOOKUP($CU161,_Afg07,$CF$285)=1,$D70/IF(Kopt2<>\"\",Kopt2,Kopt),0)","v":0},{"$f":"IF(VLOOKUP($CU161,_Afg07,$CG$285)=1,$D70/IF(Ropt2<>\"\",Ropt2,Ropt),0)","v":0},{"$f":"VLOOKUP($CU161,_Afg07,$CH$285)*$D70/IF(_Gly2<>\"\",_Gly2,Gly)","v":0},{"$f":"VLOOKUP($CU161,_Afg07,$CI$285)*$D70/IF(Gød2<>\"\",Gød2,Gød)","v":0}]
[null,"Gødning",null,{"$f":"IF(Afgnr>1,IF(T162<>\"\",T162,-D576),\"\")","v":""},{"$f":"IF(D162<>\"\",\"kr.\",\"\")","v":""},null,null,{"$f":"IF(Alt1nr>1,IF(V162<>\"\",V162,-H576),\"\")","v":""},{"$f":"IF(H162<>\"\",\"kr.\",\"\")","v":""},null,null,{"$f":"IF(Alt2nr>1,IF(X162<>\"\",X162,-L576),\"\")","v":""},{"$f":"IF(L162<>\"\",\"kr.\",\"\")","v":""},null,null,null,null,null,"Gødning",null,null,null,null,null,null,null,null,null,null,null,null,null,null,null,null,null,null,null,null,null,null,null,null,null,null,null,null,null,null,null,null,null,null,null,null,null,null,null,null,null,null,null,null,null,null,null,null,null,null,null,null,null,null,null,null,null,null,null,null,null,null,null,null,null,null,null,null,null,null,"",0,0,0,null,null,{"$f":"VLOOKUP(CU167,$R$288:$S$342,2)","v":0},{"$f":"D76","v":0},null,1,null,{"$f":"IF(CU162>1,IF(VLOOKUP(CU162,_Afg07,$BU$285)=2,IF($CU$9=2,-VLOOKUP($R$324,_Afg07,$CV$9)*Erstatpris*D91,0),0),0)","v":0},{"$f":"IF(AND(CU162>1,VLOOKUP(CU162,_Afg07,$BU$285)=1),IF(F91<>\"\",F91,G91)*D91,0)","v":0},{"$f":"IF(AND(CU162>1,VLOOKUP(CU162,_Afg07,$BU$285)=1),D91,0)","v":0},null,null,{"$f":"IF(AND(CU162>1,VLOOKUP(CU162,_Afg07,$BU$285)=1),VLOOKUP(CU162,_Afg07,Halmnr)*D91,0)","v":0},null,null,null,null,null,null,null,null,null,null,null,true,null,false,null,true,null,false,null,{"$f":"IF(VLOOKUP($CU162,_Afg07,$BV$285)=1,IF($DN162,$D91/IF(_Plo2<>\"\",_Plo2,Plo),0),0)","v":0},{"$f":"IF(VLOOKUP($CU162,_Afg07,$BV$285)=2,IF($DN162,$D91/IF(_Plo2<>\"\",_Plo2,Plo),0),0)","v":0},{"$f":"IF(VLOOKUP($CU162,_Afg07,$BV$285)=3,IF($DN162,$D91/IF(_Plo2<>\"\",_Plo2,Plo),0),0)","v":0},{"$f":"IF(VLOOKUP($CU162,_Afg07,$BZ$285)=1,IF($DP162,$D91/IF(_Stu2<>\"\",_Stu2,Stu),0),0)","v":0},{"$f":"IF(VLOOKUP($CU162,_Afg07,$BZ$285)=2,IF($DP162,$D91/IF(_Stu2<>\"\",_Stu2,Stu),0),0)","v":0},{"$f":"IF(VLOOKUP($CU162,_Afg07,$BZ$285)=3,IF($DP162,$D91/IF(_Stu2<>\"\",_Stu2,Stu),0),0)","v":0},{"$f":"IF(VLOOKUP($CU162,_Afg07,$BW$285)=1,IF($DR162,$D91/IF(Såb2<>\"\",Såb2,Såb),0),0)","v":0},{"$f":"IF(VLOOKUP($CU162,_Afg07,$BW$285)=2,IF($DR162,$D91/IF(Såb2<>\"\",Såb2,Såb),0),0)","v":0},{"$f":"IF(VLOOKUP($CU162,_Afg07,$BW$285)=3,IF($DR162,$D91/IF(Såb2<>\"\",Såb2,Såb),0),0)","v":0},{"$f":"IF(VLOOKUP($CU162,_Afg07,$BX$285)=1,IF($DT162,$D91/IF(_Gly2<>\"\",_Gly2,Gly),0),0)","v":0},{"$f":"IF(VLOOKUP($CU162,_Afg07,$BX$285)=2,IF($DT162,$D91/IF(_Gly2<>\"\",_Gly2,Gly),0),0)","v":0},{"$f":"IF(VLOOKUP($CU162,_Afg07,$BX$285)=3,IF($DT162,$D91/IF(_Gly2<>\"\",_Gly2,Gly),0),0)","v":0},{"$f":"IF(VLOOKUP($CU162,_Afg07,$BY$285)=1,$D91/IF(Såm2<>\"\",Såm2,Såm),0)","v":0},{"$f":"IF(VLOOKUP($CU162,_Afg07,$BY$285)=2,$D91/IF(Såm2<>\"\",Såm2,Såm),0)","v":0},{"$f":"IF(VLOOKUP($CU162,_Afg07,$BY$285)=3,$D91/IF(Såm2<>\"\",Såm2,Såm),0)","v":0},{"$f":"IF(VLOOKUP($CU162,_Afg07,$CA$285)=1,$D91/IF(_Mej2<>\"\",_Mej2,Mej)*VLOOKUP($CU162,_Afg07,$CC$285),0)","v":0},{"$f":"IF(VLOOKUP($CU162,_Afg07,$CA$285)=2,$D91/IF(_Mej2<>\"\",_Mej2,Mej)*VLOOKUP($CU162,_Afg07,$CC$285),0)","v":0},{"$f":"IF(VLOOKUP($CU162,_Afg07,$CA$285)=3,$D91/IF(_Mej2<>\"\",_Mej2,Mej)*VLOOKUP($CU162,_Afg07,$CC$285),0)","v":0},{"$f":"IF(HalmJa=1,IF(VLOOKUP($CU162,_Afg07,$CB$285)=1,$D91/IF(_Hal3<>\"\",_Hal3,Hal)+$D91/_Hal2,0),0)","v":0},{"$f":"IF(HalmJa=1,IF(VLOOKUP($CU162,_Afg07,$CB$285)=2,$D91/IF(_Hal3<>\"\",_Hal3,Hal)+$D91/_Hal2,0),0)","v":0},{"$f":"IF(VLOOKUP($CU162,_Afg07,$CD$285)=1,$D91/IF(_Enk2<>\"\",_Enk2,Enk),0)","v":0},{"$f":"IF(VLOOKUP($CU162,_Afg07,$CE$285)=1,$D91/IF(_Kar2<>\"\",_Kar2,Kar),0)","v":0},{"$f":"IF(VLOOKUP($CU162,_Afg07,$CF$285)=1,$D91/IF(Kopt2<>\"\",Kopt2,Kopt),0)","v":0},{"$f":"IF(VLOOKUP($CU162,_Afg07,$CG$285)=1,$D91/IF(Ropt2<>\"\",Ropt2,Ropt),0)","v":0},{"$f":"VLOOKUP($CU162,_Afg07,$CH$285)*$D91/IF(_Gly2<>\"\",_Gly2,Gly)","v":0},{"$f":"VLOOKUP($CU162,_Afg07,$CI$285)*$D91/IF(Gød2<>\"\",Gød2,Gød)","v":0}]
[null,"Planteværn",null,{"$f":"IF(CU139>1,IF(T163<>\"\",T163,-VLOOKUP(CU139,_Afg07,AM285)),\"\")","v":""},{"$f":"IF(D163<>\"\",\"kr.\",\"\")","v":""},null,null,{"$f":"IF(CV139>1,IF(V163<>\"\",V163,-VLOOKUP(CV139,_Afg07,AM285)),\"\")","v":""},{"$f":"IF(H163<>\"\",\"kr.\",\"\")","v":""},null,null,{"$f":"IF(CW139>1,IF(X163<>\"\",X163,-VLOOKUP(CW139,_Afg07,AM285)),\"\")","v":""},{"$f":"IF(L163<>\"\",\"kr.\",\"\")","v":""},null,null,null,null,null,"Planteværn",null,null,null,null,null,null,null,null,null,null,null,null,null,null,null,null,null,null,null,null,null,null,null,null,null,null,null,null,null,null,null,null,null,null,null,null,null,null,null,null,null,null,null,null,null,null,null,null,null,null,null,null,null,null,null,null,null,null,null,null,null,null,null,null,null,null,null,null,null,null,"",0,0,0,null,null,{"$f":"VLOOKUP(CU169,$R$288:$S$342,2)","v":0},{"$f":"D78","v":0},null,1,null,{"$f":"IF(CU163>1,IF(VLOOKUP(CU163,_Afg07,$BU$285)=2,IF($CU$9=2,-VLOOKUP($R$324,_Afg07,$CV$9)*Erstatpris*D72,0),0),0)","v":0},{"$f":"IF(AND(CU163>1,VLOOKUP(CU163,_Afg07,$BU$285)=1),IF(F72<>\"\",F72,G72)*D72,0)","v":0},{"$f":"IF(AND(CU163>1,VLOOKUP(CU163,_Afg07,$BU$285)=1),D72,0)","v":0},null,null,{"$f":"IF(AND(CU163>1,VLOOKUP(CU163,_Afg07,$BU$285)=1),VLOOKUP(CU163,_Afg07,Halmnr)*D72,0)","v":0},null,null,null,null,null,null,null,null,null,null,null,true,null,false,null,true,null,false,null,{"$f":"IF(VLOOKUP($CU163,_Afg07,$BV$285)=1,IF($DN163,$D72/IF(_Plo2<>\"\",_Plo2,Plo),0),0)","v":0},{"$f":"IF(VLOOKUP($CU163,_Afg07,$BV$285)=2,IF($DN163,$D72/IF(_Plo2<>\"\",_Plo2,Plo),0),0)","v":0},{"$f":"IF(VLOOKUP($CU163,_Afg07,$BV$285)=3,IF($DN163,$D72/IF(_Plo2<>\"\",_Plo2,Plo),0),0)","v":0},{"$f":"IF(VLOOKUP($CU163,_Afg07,$BZ$285)=1,IF($DP163,$D72/IF(_Stu2<>\"\",_Stu2,Stu),0),0)","v":0},{"$f":"IF(VLOOKUP($CU163,_Afg07,$BZ$285)=2,IF($DP163,$D72/IF(_Stu2<>\"\",_Stu2,Stu),0),0)","v":0},{"$f":"IF(VLOOKUP($CU163,_Afg07,$BZ$285)=3,IF($DP163,$D72/IF(_Stu2<>\"\",_Stu2,Stu),0),0)","v":0},{"$f":"IF(VLOOKUP($CU163,_Afg07,$BW$285)=1,IF($DR163,$D72/IF(Såb2<>\"\",Såb2,Såb),0),0)","v":0},{"$f":"IF(VLOOKUP($CU163,_Afg07,$BW$285)=2,IF($DR163,$D72/IF(Såb2<>\"\",Såb2,Såb),0),0)","v":0},{"$f":"IF(VLOOKUP($CU163,_Afg07,$BW$285)=3,IF($DR163,$D72/IF(Såb2<>\"\",Såb2,Såb),0),0)","v":0},{"$f":"IF(VLOOKUP($CU163,_Afg07,$BX$285)=1,IF($DT163,$D72/IF(_Gly2<>\"\",_Gly2,Gly),0),0)","v":0},{"$f":"IF(VLOOKUP($CU163,_Afg07,$BX$285)=2,IF($DT163,$D72/IF(_Gly2<>\"\",_Gly2,Gly),0),0)","v":0},{"$f":"IF(VLOOKUP($CU163,_Afg07,$BX$285)=3,IF($DT163,$D72/IF(_Gly2<>\"\",_Gly2,Gly),0),0)","v":0},{"$f":"IF(VLOOKUP($CU163,_Afg07,$BY$285)=1,$D72/IF(Såm2<>\"\",Såm2,Såm),0)","v":0},{"$f":"IF(VLOOKUP($CU163,_Afg07,$BY$285)=2,$D72/IF(Såm2<>\"\",Såm2,Såm),0)","v":0},{"$f":"IF(VLOOKUP($CU163,_Afg07,$BY$285)=3,$D72/IF(Såm2<>\"\",Såm2,Såm),0)","v":0},{"$f":"IF(VLOOKUP($CU163,_Afg07,$CA$285)=1,$D72/IF(_Mej2<>\"\",_Mej2,Mej)*VLOOKUP($CU163,_Afg07,$CC$285),0)","v":0},{"$f":"IF(VLOOKUP($CU163,_Afg07,$CA$285)=2,$D72/IF(_Mej2<>\"\",_Mej2,Mej)*VLOOKUP($CU163,_Afg07,$CC$285),0)","v":0},{"$f":"IF(VLOOKUP($CU163,_Afg07,$CA$285)=3,$D72/IF(_Mej2<>\"\",_Mej2,Mej)*VLOOKUP($CU163,_Afg07,$CC$285),0)","v":0},{"$f":"IF(HalmJa=1,IF(VLOOKUP($CU163,_Afg07,$CB$285)=1,$D72/IF(_Hal3<>\"\",_Hal3,Hal)+$D72/_Hal2,0),0)","v":0},{"$f":"IF(HalmJa=1,IF(VLOOKUP($CU163,_Afg07,$CB$285)=2,$D72/IF(_Hal3<>\"\",_Hal3,Hal)+$D72/_Hal2,0),0)","v":0},{"$f":"IF(VLOOKUP($CU163,_Afg07,$CD$285)=1,$D72/IF(_Enk2<>\"\",_Enk2,Enk),0)","v":0},{"$f":"IF(VLOOKUP($CU163,_Afg07,$CE$285)=1,$D72/IF(_Kar2<>\"\",_Kar2,Kar),0)","v":0},{"$f":"IF(VLOOKUP($CU163,_Afg07,$CF$285)=1,$D72/IF(Kopt2<>\"\",Kopt2,Kopt),0)","v":0},{"$f":"IF(VLOOKUP($CU163,_Afg07,$CG$285)=1,$D72/IF(Ropt2<>\"\",Ropt2,Ropt),0)","v":0},{"$f":"VLOOKUP($CU163,_Afg07,$CH$285)*$D72/IF(_Gly2<>\"\",_Gly2,Gly)","v":0},{"$f":"VLOOKUP($CU163,_Afg07,$CI$285)*$D72/IF(Gød2<>\"\",Gød2,Gød)","v":0}]
[null,"Diverse",null,{"$f":"IF(Afgnr>1,IF(T164<>\"\",T164,-VLOOKUP(Afgnr,_Afg07,$AN$285)-D$152*VLOOKUP(Afgnr,_Afg07,$BB$285)),\"\")","v":""},{"$f":"IF(D164<>\"\",\"kr.\",\"\")","v":""},null,null,{"$f":"IF(CV139>1,IF(V164<>\"\",V164,-VLOOKUP(CV139,_Afg07,AN285)-H152*VLOOKUP(CV139,_Afg07,BB285)),\"\")","v":""},{"$f":"IF(H164<>\"\",\"kr.\",\"\")","v":""},null,null,{"$f":"IF(CW139>1,IF(X164<>\"\",X164,-VLOOKUP(CW139,_Afg07,AN285)-L152*VLOOKUP(CW139,_Afg07,BB285)),\"\")","v":""},{"$f":"IF(L164<>\"\",\"kr.\",\"\")","v":""},null,null,null,null,null,"Diverse",null,null,null,null,null,null,null,null,null,null,null,null,null,null,null,null,null,null,null,null,null,null,null,null,null,null,null,null,null,null,null,null,null,null,null,null,null,null,null,null,null,null,null,null,null,null,null,null,null,null,null,null,null,null,null,null,null,null,null,null,null,null,null,null,null,null,null,null,null,null,"",0,0,0,null,null,{"$f":"VLOOKUP(CU171,$R$288:$S$342,2)","v":0},{"$f":"D80","v":0},null,1,null,{"$f":"IF(CU164>1,IF(VLOOKUP(CU164,_Afg07,$BU$285)=2,IF($CU$9=2,-VLOOKUP($R$324,_Afg07,$CV$9)*Erstatpris*D93,0),0),0)","v":0},{"$f":"IF(AND(CU164>1,VLOOKUP(CU164,_Afg07,$BU$285)=1),IF(F93<>\"\",F93,G93)*D93,0)","v":0},{"$f":"IF(AND(CU164>1,VLOOKUP(CU164,_Afg07,$BU$285)=1),D93,0)","v":0},null,null,{"$f":"IF(AND(CU164>1,VLOOKUP(CU164,_Afg07,$BU$285)=1),VLOOKUP(CU164,_Afg07,Halmnr)*D93,0)","v":0},null,null,null,null,null,null,null,null,null,null,null,true,null,false,null,true,null,false,null,{"$f":"IF(VLOOKUP($CU164,_Afg07,$BV$285)=1,IF($DN164,$D93/IF(_Plo2<>\"\",_Plo2,Plo),0),0)","v":0},{"$f":"IF(VLOOKUP($CU164,_Afg07,$BV$285)=2,IF($DN164,$D93/IF(_Plo2<>\"\",_Plo2,Plo),0),0)","v":0},{"$f":"IF(VLOOKUP($CU164,_Afg07,$BV$285)=3,IF($DN164,$D93/IF(_Plo2<>\"\",_Plo2,Plo),0),0)","v":0},{"$f":"IF(VLOOKUP($CU164,_Afg07,$BZ$285)=1,IF($DP164,$D93/IF(_Stu2<>\"\",_Stu2,Stu),0),0)","v":0},{"$f":"IF(VLOOKUP($CU164,_Afg07,$BZ$285)=2,IF($DP164,$D93/IF(_Stu2<>\"\",_Stu2,Stu),0),0)","v":0},{"$f":"IF(VLOOKUP($CU164,_Afg07,$BZ$285)=3,IF($DP164,$D93/IF(_Stu2<>\"\",_Stu2,Stu),0),0)","v":0},{"$f":"IF(VLOOKUP($CU164,_Afg07,$BW$285)=1,IF($DR164,$D93/IF(Såb2<>\"\",Såb2,Såb),0),0)","v":0},{"$f":"IF(VLOOKUP($CU164,_Afg07,$BW$285)=2,IF($DR164,$D93/IF(Såb2<>\"\",Såb2,Såb),0),0)","v":0},{"$f":"IF(VLOOKUP($CU164,_Afg07,$BW$285)=3,IF($DR164,$D93/IF(Såb2<>\"\",Såb2,Såb),0),0)","v":0},{"$f":"IF(VLOOKUP($CU164,_Afg07,$BX$285)=1,IF($DT164,$D93/IF(_Gly2<>\"\",_Gly2,Gly),0),0)","v":0},{"$f":"IF(VLOOKUP($CU164,_Afg07,$BX$285)=2,IF($DT164,$D93/IF(_Gly2<>\"\",_Gly2,Gly),0),0)","v":0},{"$f":"IF(VLOOKUP($CU164,_Afg07,$BX$285)=3,IF($DT164,$D93/IF(_Gly2<>\"\",_Gly2,Gly),0),0)","v":0},{"$f":"IF(VLOOKUP($CU164,_Afg07,$BY$285)=1,$D93/IF(Såm2<>\"\",Såm2,Såm),0)","v":0},{"$f":"IF(VLOOKUP($CU164,_Afg07,$BY$285)=2,$D93/IF(Såm2<>\"\",Såm2,Såm),0)","v":0},{"$f":"IF(VLOOKUP($CU164,_Afg07,$BY$285)=3,$D93/IF(Såm2<>\"\",Såm2,Såm),0)","v":0},{"$f":"IF(VLOOKUP($CU164,_Afg07,$CA$285)=1,$D93/IF(_Mej2<>\"\",_Mej2,Mej)*VLOOKUP($CU164,_Afg07,$CC$285),0)","v":0},{"$f":"IF(VLOOKUP($CU164,_Afg07,$CA$285)=2,$D93/IF(_Mej2<>\"\",_Mej2,Mej)*VLOOKUP($CU164,_Afg07,$CC$285),0)","v":0},{"$f":"IF(VLOOKUP($CU164,_Afg07,$CA$285)=3,$D93/IF(_Mej2<>\"\",_Mej2,Mej)*VLOOKUP($CU164,_Afg07,$CC$285),0)","v":0},{"$f":"IF(HalmJa=1,IF(VLOOKUP($CU164,_Afg07,$CB$285)=1,$D93/IF(_Hal3<>\"\",_Hal3,Hal)+$D93/_Hal2,0),0)","v":0},{"$f":"IF(HalmJa=1,IF(VLOOKUP($CU164,_Afg07,$CB$285)=2,$D93/IF(_Hal3<>\"\",_Hal3,Hal)+$D93/_Hal2,0),0)","v":0},{"$f":"IF(VLOOKUP($CU164,_Afg07,$CD$285)=1,$D93/IF(_Enk2<>\"\",_Enk2,Enk),0)","v":0},{"$f":"IF(VLOOKUP($CU164,_Afg07,$CE$285)=1,$D93/IF(_Kar2<>\"\",_Kar2,Kar),0)","v":0},{"$f":"IF(VLOOKUP($CU164,_Afg07,$CF$285)=1,$D93/IF(Kopt2<>\"\",Kopt2,Kopt),0)","v":0},{"$f":"IF(VLOOKUP($CU164,_Afg07,$CG$285)=1,$D93/IF(Ropt2<>\"\",Ropt2,Ropt),0)","v":0},{"$f":"VLOOKUP($CU164,_Afg07,$CH$285)*$D93/IF(_Gly2<>\"\",_Gly2,Gly)","v":0},{"$f":"VLOOKUP($CU164,_Afg07,$CI$285)*$D93/IF(Gød2<>\"\",Gød2,Gød)","v":0}]
[null,"Stykomkostninger i alt",null,{"$f":"IF(Afgnr>1,D161+D162+D163+D164,\"\")","v":""},{"$f":"IF(D165<>\"\",\"kr.\",\"\")","v":""},null,null,{"$f":"IF(Alt1nr>1,H161+H162+H163+H164,\"\")","v":""},{"$f":"IF(H165<>\"\",\"kr.\",\"\")","v":""},null,null,{"$f":"IF(Alt2nr>1,L161+L162+L163+L164,\"\")","v":""},{"$f":"IF(L165<>\"\",\"kr.\",\"\")","v":""},null,null,null,null,null,null,{"$f":"IF(OR(T161>0,T162>0,T163>0,T164>0),\"Husk minus foran\",\"\")","v":""},null,{"$f":"IF(OR(V161>0,V162>0,V163>0,V164>0),\"Husk minus foran\",\"\")","v":""},null,{"$f":"IF(OR(X161>0,X162>0,X163>0,X164>0),\"Husk minus foran\",\"\")","v":""},null,null,null,null,null,null,null,null,null,null,null,null,null,null,null,null,null,null,null,null,null,null,null,null,null,null,null,null,null,null,null,null,null,null,null,null,null,null,null,null,null,null,null,null,null,null,null,null,null,null,null,null,null,null,null,null,null,null,null,null,null,null,null,null,null,null,null,null,null,null,null,null,null,null,1,null,{"$f":"IF(CU165>1,IF(VLOOKUP(CU165,_Afg07,$BU$285)=2,IF($CU$9=2,-VLOOKUP($R$324,_Afg07,$CV$9)*Erstatpris*D74,0),0),0)","v":0},{"$f":"IF(AND(CU165>1,VLOOKUP(CU165,_Afg07,$BU$285)=1),IF(F74<>\"\",F74,G74)*D74,0)","v":0},{"$f":"IF(AND(CU165>1,VLOOKUP(CU165,_Afg07,$BU$285)=1),D74,0)","v":0},null,null,{"$f":"IF(AND(CU165>1,VLOOKUP(CU165,_Afg07,$BU$285)=1),VLOOKUP(CU165,_Afg07,Halmnr)*D74,0)","v":0},null,null,null,null,null,null,null,null,null,null,null,true,null,false,null,true,null,false,null,{"$f":"IF(VLOOKUP($CU165,_Afg07,$BV$285)=1,IF($DN165,$D74/IF(_Plo2<>\"\",_Plo2,Plo),0),0)","v":0},{"$f":"IF(VLOOKUP($CU165,_Afg07,$BV$285)=2,IF($DN165,$D74/IF(_Plo2<>\"\",_Plo2,Plo),0),0)","v":0},{"$f":"IF(VLOOKUP($CU165,_Afg07,$BV$285)=3,IF($DN165,$D74/IF(_Plo2<>\"\",_Plo2,Plo),0),0)","v":0},{"$f":"IF(VLOOKUP($CU165,_Afg07,$BZ$285)=1,IF($DP165,$D74/IF(_Stu2<>\"\",_Stu2,Stu),0),0)","v":0},{"$f":"IF(VLOOKUP($CU165,_Afg07,$BZ$285)=2,IF($DP165,$D74/IF(_Stu2<>\"\",_Stu2,Stu),0),0)","v":0},{"$f":"IF(VLOOKUP($CU165,_Afg07,$BZ$285)=3,IF($DP165,$D74/IF(_Stu2<>\"\",_Stu2,Stu),0),0)","v":0},{"$f":"IF(VLOOKUP($CU165,_Afg07,$BW$285)=1,IF($DR165,$D74/IF(Såb2<>\"\",Såb2,Såb),0),0)","v":0},{"$f":"IF(VLOOKUP($CU165,_Afg07,$BW$285)=2,IF($DR165,$D74/IF(Såb2<>\"\",Såb2,Såb),0),0)","v":0},{"$f":"IF(VLOOKUP($CU165,_Afg07,$BW$285)=3,IF($DR165,$D74/IF(Såb2<>\"\",Såb2,Såb),0),0)","v":0},{"$f":"IF(VLOOKUP($CU165,_Afg07,$BX$285)=1,IF($DT165,$D74/IF(_Gly2<>\"\",_Gly2,Gly),0),0)","v":0},{"$f":"IF(VLOOKUP($CU165,_Afg07,$BX$285)=2,IF($DT165,$D74/IF(_Gly2<>\"\",_Gly2,Gly),0),0)","v":0},{"$f":"IF(VLOOKUP($CU165,_Afg07,$BX$285)=3,IF($DT165,$D74/IF(_Gly2<>\"\",_Gly2,Gly),0),0)","v":0},{"$f":"IF(VLOOKUP($CU165,_Afg07,$BY$285)=1,$D74/IF(Såm2<>\"\",Såm2,Såm),0)","v":0},{"$f":"IF(VLOOKUP($CU165,_Afg07,$BY$285)=2,$D74/IF(Såm2<>\"\",Såm2,Såm),0)","v":0},{"$f":"IF(VLOOKUP($CU165,_Afg07,$BY$285)=3,$D74/IF(Såm2<>\"\",Såm2,Såm),0)","v":0},{"$f":"IF(VLOOKUP($CU165,_Afg07,$CA$285)=1,$D74/IF(_Mej2<>\"\",_Mej2,Mej)*VLOOKUP($CU165,_Afg07,$CC$285),0)","v":0},{"$f":"IF(VLOOKUP($CU165,_Afg07,$CA$285)=2,$D74/IF(_Mej2<>\"\",_Mej2,Mej)*VLOOKUP($CU165,_Afg07,$CC$285),0)","v":0},{"$f":"IF(VLOOKUP($CU165,_Afg07,$CA$285)=3,$D74/IF(_Mej2<>\"\",_Mej2,Mej)*VLOOKUP($CU165,_Afg07,$CC$285),0)","v":0},{"$f":"IF(HalmJa=1,IF(VLOOKUP($CU165,_Afg07,$CB$285)=1,$D74/IF(_Hal3<>\"\",_Hal3,Hal)+$D74/_Hal2,0),0)","v":0},{"$f":"IF(HalmJa=1,IF(VLOOKUP($CU165,_Afg07,$CB$285)=2,$D74/IF(_Hal3<>\"\",_Hal3,Hal)+$D74/_Hal2,0),0)","v":0},{"$f":"IF(VLOOKUP($CU165,_Afg07,$CD$285)=1,$D74/IF(_Enk2<>\"\",_Enk2,Enk),0)","v":0},{"$f":"IF(VLOOKUP($CU165,_Afg07,$CE$285)=1,$D74/IF(_Kar2<>\"\",_Kar2,Kar),0)","v":0},{"$f":"IF(VLOOKUP($CU165,_Afg07,$CF$285)=1,$D74/IF(Kopt2<>\"\",Kopt2,Kopt),0)","v":0},{"$f":"IF(VLOOKUP($CU165,_Afg07,$CG$285)=1,$D74/IF(Ropt2<>\"\",Ropt2,Ropt),0)","v":0},{"$f":"VLOOKUP($CU165,_Afg07,$CH$285)*$D74/IF(_Gly2<>\"\",_Gly2,Gly)","v":0},{"$f":"VLOOKUP($CU165,_Afg07,$CI$285)*$D74/IF(Gød2<>\"\",Gød2,Gød)","v":0}]
[null,null,null,null,null,null,null,null,null,null,null,null,null,null,null,null,null,null,null,null,null,null,null,null,null,null,null,null,null,null,null,null,null,null,null,null,null,null,null,null,null,null,null,null,null,null,null,null,null,null,null,null,null,null,null,null,null,null,null,null,null,null,null,null,null,null,null,null,null,null,null,null,null,null,null,null,null,null,null,null,null,null,null,null,null,null,null,null,null,null,null,null,null,null,null,null,null,null,1,null,{"$f":"IF(CU166>1,IF(VLOOKUP(CU166,_Afg07,$BU$285)=2,IF($CU$9=2,-VLOOKUP($R$324,_Afg07,$CV$9)*Erstatpris*D95,0),0),0)","v":0},{"$f":"IF(AND(CU166>1,VLOOKUP(CU166,_Afg07,$BU$285)=1),IF(F95<>\"\",F95,G95)*D95,0)","v":0},{"$f":"IF(AND(CU166>1,VLOOKUP(CU166,_Afg07,$BU$285)=1),D95,0)","v":0},null,null,{"$f":"IF(AND(CU166>1,VLOOKUP(CU166,_Afg07,$BU$285)=1),VLOOKUP(CU166,_Afg07,Halmnr)*D95,0)","v":0},null,null,null,null,null,null,null,null,null,null,null,true,null,false,null,true,null,false,null,{"$f":"IF(VLOOKUP($CU166,_Afg07,$BV$285)=1,IF($DN166,$D95/IF(_Plo2<>\"\",_Plo2,Plo),0),0)","v":0},{"$f":"IF(VLOOKUP($CU166,_Afg07,$BV$285)=2,IF($DN166,$D95/IF(_Plo2<>\"\",_Plo2,Plo),0),0)","v":0},{"$f":"IF(VLOOKUP($CU166,_Afg07,$BV$285)=3,IF($DN166,$D95/IF(_Plo2<>\"\",_Plo2,Plo),0),0)","v":0},{"$f":"IF(VLOOKUP($CU166,_Afg07,$BZ$285)=1,IF($DP166,$D95/IF(_Stu2<>\"\",_Stu2,Stu),0),0)","v":0},{"$f":"IF(VLOOKUP($CU166,_Afg07,$BZ$285)=2,IF($DP166,$D95/IF(_Stu2<>\"\",_Stu2,Stu),0),0)","v":0},{"$f":"IF(VLOOKUP($CU166,_Afg07,$BZ$285)=3,IF($DP166,$D95/IF(_Stu2<>\"\",_Stu2,Stu),0),0)","v":0},{"$f":"IF(VLOOKUP($CU166,_Afg07,$BW$285)=1,IF($DR166,$D95/IF(Såb2<>\"\",Såb2,Såb),0),0)","v":0},{"$f":"IF(VLOOKUP($CU166,_Afg07,$BW$285)=2,IF($DR166,$D95/IF(Såb2<>\"\",Såb2,Såb),0),0)","v":0},{"$f":"IF(VLOOKUP($CU166,_Afg07,$BW$285)=3,IF($DR166,$D95/IF(Såb2<>\"\",Såb2,Såb),0),0)","v":0},{"$f":"IF(VLOOKUP($CU166,_Afg07,$BX$285)=1,IF($DT166,$D95/IF(_Gly2<>\"\",_Gly2,Gly),0),0)","v":0},{"$f":"IF(VLOOKUP($CU166,_Afg07,$BX$285)=2,IF($DT166,$D95/IF(_Gly2<>\"\",_Gly2,Gly),0),0)","v":0},{"$f":"IF(VLOOKUP($CU166,_Afg07,$BX$285)=3,IF($DT166,$D95/IF(_Gly2<>\"\",_Gly2,Gly),0),0)","v":0},{"$f":"IF(VLOOKUP($CU166,_Afg07,$BY$285)=1,$D95/IF(Såm2<>\"\",Såm2,Såm),0)","v":0},{"$f":"IF(VLOOKUP($CU166,_Afg07,$BY$285)=2,$D95/IF(Såm2<>\"\",Såm2,Såm),0)","v":0},{"$f":"IF(VLOOKUP($CU166,_Afg07,$BY$285)=3,$D95/IF(Såm2<>\"\",Såm2,Såm),0)","v":0},{"$f":"IF(VLOOKUP($CU166,_Afg07,$CA$285)=1,$D95/IF(_Mej2<>\"\",_Mej2,Mej)*VLOOKUP($CU166,_Afg07,$CC$285),0)","v":0},{"$f":"IF(VLOOKUP($CU166,_Afg07,$CA$285)=2,$D95/IF(_Mej2<>\"\",_Mej2,Mej)*VLOOKUP($CU166,_Afg07,$CC$285),0)","v":0},{"$f":"IF(VLOOKUP($CU166,_Afg07,$CA$285)=3,$D95/IF(_Mej2<>\"\",_Mej2,Mej)*VLOOKUP($CU166,_Afg07,$CC$285),0)","v":0},{"$f":"IF(HalmJa=1,IF(VLOOKUP($CU166,_Afg07,$CB$285)=1,$D95/IF(_Hal3<>\"\",_Hal3,Hal)+$D95/_Hal2,0),0)","v":0},{"$f":"IF(HalmJa=1,IF(VLOOKUP($CU166,_Afg07,$CB$285)=2,$D95/IF(_Hal3<>\"\",_Hal3,Hal)+$D95/_Hal2,0),0)","v":0},{"$f":"IF(VLOOKUP($CU166,_Afg07,$CD$285)=1,$D95/IF(_Enk2<>\"\",_Enk2,Enk),0)","v":0},{"$f":"IF(VLOOKUP($CU166,_Afg07,$CE$285)=1,$D95/IF(_Kar2<>\"\",_Kar2,Kar),0)","v":0},{"$f":"IF(VLOOKUP($CU166,_Afg07,$CF$285)=1,$D95/IF(Kopt2<>\"\",Kopt2,Kopt),0)","v":0},{"$f":"IF(VLOOKUP($CU166,_Afg07,$CG$285)=1,$D95/IF(Ropt2<>\"\",Ropt2,Ropt),0)","v":0},{"$f":"VLOOKUP($CU166,_Afg07,$CH$285)*$D95/IF(_Gly2<>\"\",_Gly2,Gly)","v":0},{"$f":"VLOOKUP($CU166,_Afg07,$CI$285)*$D95/IF(Gød2<>\"\",Gød2,Gød)","v":0}]
[null,"Dækningsbidrag",null,{"$f":"IF(Afgnr>1,(D159+D165),\"\")","v":""},{"$f":"IF(D167<>\"\",\"kr.\",\"\")","v":""},null,null,{"$f":"IF(Alt1nr>1,(H159+H165),\"\")","v":""},{"$f":"IF(H167<>\"\",\"kr.\",\"\")","v":""},null,null,{"$f":"IF(Alt2nr>1,(L159+L165),\"\")","v":""},{"$f":"IF(L167<>\"\",\"kr.\",\"\")","v":""},null,null,null,null,null,null,null,null,null,null,null,null,null,null,null,null,null,null,null,null,null,null,null,null,null,null,null,null,null,null,null,null,null,null,null,null,null,null,null,null,null,null,null,null,null,null,null,null,null,null,null,null,null,null,null,null,null,null,null,null,null,null,null,null,null,null,null,null,null,null,null,null,null,null,null,null,null,null,null,null,null,null,null,null,null,1,null,{"$f":"IF(CU167>1,IF(VLOOKUP(CU167,_Afg07,$BU$285)=2,IF($CU$9=2,-VLOOKUP($R$324,_Afg07,$CV$9)*Erstatpris*D76,0),0),0)","v":0},{"$f":"IF(AND(CU167>1,VLOOKUP(CU167,_Afg07,$BU$285)=1),IF(F76<>\"\",F76,G76)*D76,0)","v":0},{"$f":"IF(AND(CU167>1,VLOOKUP(CU167,_Afg07,$BU$285)=1),D76,0)","v":0},null,null,{"$f":"IF(AND(CU167>1,VLOOKUP(CU167,_Afg07,$BU$285)=1),VLOOKUP(CU167,_Afg07,Halmnr)*D76,0)","v":0},null,null,null,null,null,null,null,null,null,null,null,true,null,false,null,true,null,false,null,{"$f":"IF(VLOOKUP($CU167,_Afg07,$BV$285)=1,IF($DN167,$D76/IF(_Plo2<>\"\",_Plo2,Plo),0),0)","v":0},{"$f":"IF(VLOOKUP($CU167,_Afg07,$BV$285)=2,IF($DN167,$D76/IF(_Plo2<>\"\",_Plo2,Plo),0),0)","v":0},{"$f":"IF(VLOOKUP($CU167,_Afg07,$BV$285)=3,IF($DN167,$D76/IF(_Plo2<>\"\",_Plo2,Plo),0),0)","v":0},{"$f":"IF(VLOOKUP($CU167,_Afg07,$BZ$285)=1,IF($DP167,$D76/IF(_Stu2<>\"\",_Stu2,Stu),0),0)","v":0},{"$f":"IF(VLOOKUP($CU167,_Afg07,$BZ$285)=2,IF($DP167,$D76/IF(_Stu2<>\"\",_Stu2,Stu),0),0)","v":0},{"$f":"IF(VLOOKUP($CU167,_Afg07,$BZ$285)=3,IF($DP167,$D76/IF(_Stu2<>\"\",_Stu2,Stu),0),0)","v":0},{"$f":"IF(VLOOKUP($CU167,_Afg07,$BW$285)=1,IF($DR167,$D76/IF(Såb2<>\"\",Såb2,Såb),0),0)","v":0},{"$f":"IF(VLOOKUP($CU167,_Afg07,$BW$285)=2,IF($DR167,$D76/IF(Såb2<>\"\",Såb2,Såb),0),0)","v":0},{"$f":"IF(VLOOKUP($CU167,_Afg07,$BW$285)=3,IF($DR167,$D76/IF(Såb2<>\"\",Såb2,Såb),0),0)","v":0},{"$f":"IF(VLOOKUP($CU167,_Afg07,$BX$285)=1,IF($DT167,$D76/IF(_Gly2<>\"\",_Gly2,Gly),0),0)","v":0},{"$f":"IF(VLOOKUP($CU167,_Afg07,$BX$285)=2,IF($DT167,$D76/IF(_Gly2<>\"\",_Gly2,Gly),0),0)","v":0},{"$f":"IF(VLOOKUP($CU167,_Afg07,$BX$285)=3,IF($DT167,$D76/IF(_Gly2<>\"\",_Gly2,Gly),0),0)","v":0},{"$f":"IF(VLOOKUP($CU167,_Afg07,$BY$285)=1,$D76/IF(Såm2<>\"\",Såm2,Såm),0)","v":0},{"$f":"IF(VLOOKUP($CU167,_Afg07,$BY$285)=2,$D76/IF(Såm2<>\"\",Såm2,Såm),0)","v":0},{"$f":"IF(VLOOKUP($CU167,_Afg07,$BY$285)=3,$D76/IF(Såm2<>\"\",Såm2,Såm),0)","v":0},{"$f":"IF(VLOOKUP($CU167,_Afg07,$CA$285)=1,$D76/IF(_Mej2<>\"\",_Mej2,Mej)*VLOOKUP($CU167,_Afg07,$CC$285),0)","v":0},{"$f":"IF(VLOOKUP($CU167,_Afg07,$CA$285)=2,$D76/IF(_Mej2<>\"\",_Mej2,Mej)*VLOOKUP($CU167,_Afg07,$CC$285),0)","v":0},{"$f":"IF(VLOOKUP($CU167,_Afg07,$CA$285)=3,$D76/IF(_Mej2<>\"\",_Mej2,Mej)*VLOOKUP($CU167,_Afg07,$CC$285),0)","v":0},{"$f":"IF(HalmJa=1,IF(VLOOKUP($CU167,_Afg07,$CB$285)=1,$D76/IF(_Hal3<>\"\",_Hal3,Hal)+$D76/_Hal2,0),0)","v":0},{"$f":"IF(HalmJa=1,IF(VLOOKUP($CU167,_Afg07,$CB$285)=2,$D76/IF(_Hal3<>\"\",_Hal3,Hal)+$D76/_Hal2,0),0)","v":0},{"$f":"IF(VLOOKUP($CU167,_Afg07,$CD$285)=1,$D76/IF(_Enk2<>\"\",_Enk2,Enk),0)","v":0},{"$f":"IF(VLOOKUP($CU167,_Afg07,$CE$285)=1,$D76/IF(_Kar2<>\"\",_Kar2,Kar),0)","v":0},{"$f":"IF(VLOOKUP($CU167,_Afg07,$CF$285)=1,$D76/IF(Kopt2<>\"\",Kopt2,Kopt),0)","v":0},{"$f":"IF(VLOOKUP($CU167,_Afg07,$CG$285)=1,$D76/IF(Ropt2<>\"\",Ropt2,Ropt),0)","v":0},{"$f":"VLOOKUP($CU167,_Afg07,$CH$285)*$D76/IF(_Gly2<>\"\",_Gly2,Gly)","v":0},{"$f":"VLOOKUP($CU167,_Afg07,$CI$285)*$D76/IF(Gød2<>\"\",Gød2,Gød)","v":0}]
[null,null,null,null,null,null,null,null,null,null,null,null,null,null,null,null,null,null,null,null,null,null,null,null,null,null,null,null,null,null,null,null,null,null,null,null,null,null,null,null,null,null,null,null,null,null,null,null,null,null,null,null,null,null,null,null,null,null,null,null,null,null,null,null,null,null,null,null,null,null,null,null,null,null,null,null,null,null,null,null,null,null,null,null,null,null,null,null,null,"Kagediagram 2",null,null,null,null,null,"Kagediagram Lopslag",null,null,1,null,{"$f":"IF(CU168>1,IF(VLOOKUP(CU168,_Afg07,$BU$285)=2,IF($CU$9=2,-VLOOKUP($R$324,_Afg07,$CV$9)*Erstatpris*D97,0),0),0)","v":0},{"$f":"IF(AND(CU168>1,VLOOKUP(CU168,_Afg07,$BU$285)=1),IF(F97<>\"\",F97,G97)*D97,0)","v":0},{"$f":"IF(AND(CU168>1,VLOOKUP(CU168,_Afg07,$BU$285)=1),D97,0)","v":0},null,null,{"$f":"IF(AND(CU168>1,VLOOKUP(CU168,_Afg07,$BU$285)=1),VLOOKUP(CU168,_Afg07,Halmnr)*D97,0)","v":0},null,null,null,null,null,null,null,null,null,null,null,true,null,false,null,true,null,false,null,{"$f":"IF(VLOOKUP($CU168,_Afg07,$BV$285)=1,IF($DN168,$D97/IF(_Plo2<>\"\",_Plo2,Plo),0),0)","v":0},{"$f":"IF(VLOOKUP($CU168,_Afg07,$BV$285)=2,IF($DN168,$D97/IF(_Plo2<>\"\",_Plo2,Plo),0),0)","v":0},{"$f":"IF(VLOOKUP($CU168,_Afg07,$BV$285)=3,IF($DN168,$D97/IF(_Plo2<>\"\",_Plo2,Plo),0),0)","v":0},{"$f":"IF(VLOOKUP($CU168,_Afg07,$BZ$285)=1,IF($DP168,$D97/IF(_Stu2<>\"\",_Stu2,Stu),0),0)","v":0},{"$f":"IF(VLOOKUP($CU168,_Afg07,$BZ$285)=2,IF($DP168,$D97/IF(_Stu2<>\"\",_Stu2,Stu),0),0)","v":0},{"$f":"IF(VLOOKUP($CU168,_Afg07,$BZ$285)=3,IF($DP168,$D97/IF(_Stu2<>\"\",_Stu2,Stu),0),0)","v":0},{"$f":"IF(VLOOKUP($CU168,_Afg07,$BW$285)=1,IF($DR168,$D97/IF(Såb2<>\"\",Såb2,Såb),0),0)","v":0},{"$f":"IF(VLOOKUP($CU168,_Afg07,$BW$285)=2,IF($DR168,$D97/IF(Såb2<>\"\",Såb2,Såb),0),0)","v":0},{"$f":"IF(VLOOKUP($CU168,_Afg07,$BW$285)=3,IF($DR168,$D97/IF(Såb2<>\"\",Såb2,Såb),0),0)","v":0},{"$f":"IF(VLOOKUP($CU168,_Afg07,$BX$285)=1,IF($DT168,$D97/IF(_Gly2<>\"\",_Gly2,Gly),0),0)","v":0},{"$f":"IF(VLOOKUP($CU168,_Afg07,$BX$285)=2,IF($DT168,$D97/IF(_Gly2<>\"\",_Gly2,Gly),0),0)","v":0},{"$f":"IF(VLOOKUP($CU168,_Afg07,$BX$285)=3,IF($DT168,$D97/IF(_Gly2<>\"\",_Gly2,Gly),0),0)","v":0},{"$f":"IF(VLOOKUP($CU168,_Afg07,$BY$285)=1,$D97/IF(Såm2<>\"\",Såm2,Såm),0)","v":0},{"$f":"IF(VLOOKUP($CU168,_Afg07,$BY$285)=2,$D97/IF(Såm2<>\"\",Såm2,Såm),0)","v":0},{"$f":"IF(VLOOKUP($CU168,_Afg07,$BY$285)=3,$D97/IF(Såm2<>\"\",Såm2,Såm),0)","v":0},{"$f":"IF(VLOOKUP($CU168,_Afg07,$CA$285)=1,$D97/IF(_Mej2<>\"\",_Mej2,Mej)*VLOOKUP($CU168,_Afg07,$CC$285),0)","v":0},{"$f":"IF(VLOOKUP($CU168,_Afg07,$CA$285)=2,$D97/IF(_Mej2<>\"\",_Mej2,Mej)*VLOOKUP($CU168,_Afg07,$CC$285),0)","v":0},{"$f":"IF(VLOOKUP($CU168,_Afg07,$CA$285)=3,$D97/IF(_Mej2<>\"\",_Mej2,Mej)*VLOOKUP($CU168,_Afg07,$CC$285),0)","v":0},{"$f":"IF(HalmJa=1,IF(VLOOKUP($CU168,_Afg07,$CB$285)=1,$D97/IF(_Hal3<>\"\",_Hal3,Hal)+$D97/_Hal2,0),0)","v":0},{"$f":"IF(HalmJa=1,IF(VLOOKUP($CU168,_Afg07,$CB$285)=2,$D97/IF(_Hal3<>\"\",_Hal3,Hal)+$D97/_Hal2,0),0)","v":0},{"$f":"IF(VLOOKUP($CU168,_Afg07,$CD$285)=1,$D97/IF(_Enk2<>\"\",_Enk2,Enk),0)","v":0},{"$f":"IF(VLOOKUP($CU168,_Afg07,$CE$285)=1,$D97/IF(_Kar2<>\"\",_Kar2,Kar),0)","v":0},{"$f":"IF(VLOOKUP($CU168,_Afg07,$CF$285)=1,$D97/IF(Kopt2<>\"\",Kopt2,Kopt),0)","v":0},{"$f":"IF(VLOOKUP($CU168,_Afg07,$CG$285)=1,$D97/IF(Ropt2<>\"\",Ropt2,Ropt),0)","v":0},{"$f":"VLOOKUP($CU168,_Afg07,$CH$285)*$D97/IF(_Gly2<>\"\",_Gly2,Gly)","v":0},{"$f":"VLOOKUP($CU168,_Afg07,$CI$285)*$D97/IF(Gød2<>\"\",Gød2,Gød)","v":0}]
[null,"Maskiner og arbejde",null,{"$f":"IF(Afgnr=1,\"\",IF(Afgnr>1,IF(T169<>\"\",T169,-VLOOKUP(Afgnr,_Afg07,$CW$7)),\"\")-IF(Hdgnr>1,VLOOKUP(Afgnr,_Afg07,51,FALSE)*VLOOKUP(Afgnr,_Afg07,71,FALSE),0))","v":""},{"$f":"IF(D169<>\"\",\"kr.\",\"\")","v":""},null,null,{"$f":"IF(CV139=1,\"\",IF(CV139>1,IF(V169<>\"\",V169,-VLOOKUP(CV139,_Afg07,$CW$7)),\"\")-IF(Hdgnr>1,VLOOKUP(Afgnr,_Afg07,51,FALSE)*VLOOKUP(Afgnr,_Afg07,71,FALSE),0))","v":""},{"$f":"IF(H169<>\"\",\"kr.\",\"\")","v":""},null,null,{"$f":"IF(CW139=1,\"\",IF(CW139>1,IF(X169<>\"\",X169,-VLOOKUP(CW139,_Afg07,$CW$7)),\"\")-IF(Hdgnr>1,VLOOKUP(Afgnr,_Afg07,51,FALSE)*VLOOKUP(Afgnr,_Afg07,71,FALSE),0))","v":""},{"$f":"IF(L169<>\"\",\"kr.\",\"\")","v":""},null,null,null,null,null,"Maskiner og arbejde",null,null,null,null,null,null,null,null,null,null,null,null,null,null,null,null,null,null,null,null,null,null,null,null,null,null,null,null,null,null,null,null,null,null,null,null,null,null,null,null,null,null,null,null,null,null,null,null,null,null,null,null,null,null,null,null,null,null,null,null,null,null,null,null,null,null,null,null,null,null,{"$f":"IF(CM169=0,\"\",_xlfn.CONCAT(CM169,\" \",\"(\",CO169,\"ha\",\")\"))","v":""},{"$f":"IF(CN169=\"Egen afgrøde\",$C$43,CN169)","v":0},{"$f":"IF(CR169=$CM$151,0,IF(CR169=$CM$152,0,IF(CR169=$CM$153,0,CR169)))","v":0},{"$f":"IF(CR169=$CM$151,0,IF(CR169=$CM$152,0,IF(CR169=$CM$153,0,CS169)))","v":0},null,null,{"$f":"VLOOKUP(CU160,$R$288:$S$342,2)","v":0},{"$f":"D89","v":0},null,1,null,{"$f":"IF(CU169>1,IF(VLOOKUP(CU169,_Afg07,$BU$285)=2,IF($CU$9=2,-VLOOKUP($R$324,_Afg07,$CV$9)*Erstatpris*D78,0),0),0)","v":0},{"$f":"IF(AND(CU169>1,VLOOKUP(CU169,_Afg07,$BU$285)=1),IF(F78<>\"\",F78,G78)*D78,0)","v":0},{"$f":"IF(AND(CU169>1,VLOOKUP(CU169,_Afg07,$BU$285)=1),D78,0)","v":0},null,null,{"$f":"IF(AND(CU169>1,VLOOKUP(CU169,_Afg07,$BU$285)=1),VLOOKUP(CU169,_Afg07,Halmnr)*D78,0)","v":0},null,null,null,null,"Lager til korn",null,null,null,null,null,null,true,null,false,null,true,null,false,null,{"$f":"IF(VLOOKUP($CU169,_Afg07,$BV$285)=1,IF($DN169,$D78/IF(_Plo2<>\"\",_Plo2,Plo),0),0)","v":0},{"$f":"IF(VLOOKUP($CU169,_Afg07,$BV$285)=2,IF($DN169,$D78/IF(_Plo2<>\"\",_Plo2,Plo),0),0)","v":0},{"$f":"IF(VLOOKUP($CU169,_Afg07,$BV$285)=3,IF($DN169,$D78/IF(_Plo2<>\"\",_Plo2,Plo),0),0)","v":0},{"$f":"IF(VLOOKUP($CU169,_Afg07,$BZ$285)=1,IF($DP169,$D78/IF(_Stu2<>\"\",_Stu2,Stu),0),0)","v":0},{"$f":"IF(VLOOKUP($CU169,_Afg07,$BZ$285)=2,IF($DP169,$D78/IF(_Stu2<>\"\",_Stu2,Stu),0),0)","v":0},{"$f":"IF(VLOOKUP($CU169,_Afg07,$BZ$285)=3,IF($DP169,$D78/IF(_Stu2<>\"\",_Stu2,Stu),0),0)","v":0},{"$f":"IF(VLOOKUP($CU169,_Afg07,$BW$285)=1,IF($DR169,$D78/IF(Såb2<>\"\",Såb2,Såb),0),0)","v":0},{"$f":"IF(VLOOKUP($CU169,_Afg07,$BW$285)=2,IF($DR169,$D78/IF(Såb2<>\"\",Såb2,Såb),0),0)","v":0},{"$f":"IF(VLOOKUP($CU169,_Afg07,$BW$285)=3,IF($DR169,$D78/IF(Såb2<>\"\",Såb2,Såb),0),0)","v":0},{"$f":"IF(VLOOKUP($CU169,_Afg07,$BX$285)=1,IF($DT169,$D78/IF(_Gly2<>\"\",_Gly2,Gly),0),0)","v":0},{"$f":"IF(VLOOKUP($CU169,_Afg07,$BX$285)=2,IF($DT169,$D78/IF(_Gly2<>\"\",_Gly2,Gly),0),0)","v":0},{"$f":"IF(VLOOKUP($CU169,_Afg07,$BX$285)=3,IF($DT169,$D78/IF(_Gly2<>\"\",_Gly2,Gly),0),0)","v":0},{"$f":"IF(VLOOKUP($CU169,_Afg07,$BY$285)=1,$D78/IF(Såm2<>\"\",Såm2,Såm),0)","v":0},{"$f":"IF(VLOOKUP($CU169,_Afg07,$BY$285)=2,$D78/IF(Såm2<>\"\",Såm2,Såm),0)","v":0},{"$f":"IF(VLOOKUP($CU169,_Afg07,$BY$285)=3,$D78/IF(Såm2<>\"\",Såm2,Såm),0)","v":0},{"$f":"IF(VLOOKUP($CU169,_Afg07,$CA$285)=1,$D78/IF(_Mej2<>\"\",_Mej2,Mej)*VLOOKUP($CU169,_Afg07,$CC$285),0)","v":0},{"$f":"IF(VLOOKUP($CU169,_Afg07,$CA$285)=2,$D78/IF(_Mej2<>\"\",_Mej2,Mej)*VLOOKUP($CU169,_Afg07,$CC$285),0)","v":0},{"$f":"IF(VLOOKUP($CU169,_Afg07,$CA$285)=3,$D78/IF(_Mej2<>\"\",_Mej2,Mej)*VLOOKUP($CU169,_Afg07,$CC$285),0)","v":0},{"$f":"IF(HalmJa=1,IF(VLOOKUP($CU169,_Afg07,$CB$285)=1,$D78/IF(_Hal3<>\"\",_Hal3,Hal)+$D78/_Hal2,0),0)","v":0},{"$f":"IF(HalmJa=1,IF(VLOOKUP($CU169,_Afg07,$CB$285)=2,$D78/IF(_Hal3<>\"\",_Hal3,Hal)+$D78/_Hal2,0),0)","v":0},{"$f":"IF(VLOOKUP($CU169,_Afg07,$CD$285)=1,$D78/IF(_Enk2<>\"\",_Enk2,Enk),0)","v":0},{"$f":"IF(VLOOKUP($CU169,_Afg07,$CE$285)=1,$D78/IF(_Kar2<>\"\",_Kar2,Kar),0)","v":0},{"$f":"IF(VLOOKUP($CU169,_Afg07,$CF$285)=1,$D78/IF(Kopt2<>\"\",Kopt2,Kopt),0)","v":0},{"$f":"IF(VLOOKUP($CU169,_Afg07,$CG$285)=1,$D78/IF(Ropt2<>\"\",Ropt2,Ropt),0)","v":0},{"$f":"VLOOKUP($CU169,_Afg07,$CH$285)*$D78/IF(_Gly2<>\"\",_Gly2,Gly)","v":0},{"$f":"VLOOKUP($CU169,_Afg07,$CI$285)*$D78/IF(Gød2<>\"\",Gød2,Gød)","v":0}]
[null,{"$f":"IF(Tørringnr=1,\"Tørring (løntørring)\",\"Tørring (korn i eget tørreri)\")","v":"Tørring (korn i eget tørreri)"},null,{"$f":"IF(Afgnr>1,IF(T170<>\"\",T170,IF(VLOOKUP(Afgnr,_Afg07,$BU$285)=2,-VLOOKUP(Afgnr,_Afg07,$BN$285)*D$152,IF(AND(VLOOKUP(Afgnr,_Afg07,$BU$285)=1,$CX$5=4),0,IF($CX$7=1,-VLOOKUP(Afgnr,_Afg07,$BN$285)*D$152,-VLOOKUP(Afgnr,_Afg07,$BO$285)*D$152)))),\"\")","v":""},{"$f":"IF(D170<>\"\",\"kr.\",\"\")","v":""},null,null,{"$f":"IF(Alt1nr>1,IF(V170<>\"\",V170,IF(VLOOKUP(Alt1nr,_Afg07,$BU$285)=2,-VLOOKUP(Alt1nr,_Afg07,$BN$285)*H152,IF(AND(VLOOKUP(Alt1nr,_Afg07,$BU$285)=1,$CX$5=4),0,IF($CX$7=1,-VLOOKUP(Alt1nr,_Afg07,$BN$285)*H152,-VLOOKUP(Alt1nr,_Afg07,$BO$285)*H152)))),\"\")","v":""},{"$f":"IF(H170<>\"\",\"kr.\",\"\")","v":""},null,null,{"$f":"IF(Alt2nr>1,IF(X170<>\"\",X170,IF(VLOOKUP(Alt2nr,_Afg07,$BU$285)=2,-VLOOKUP(Alt2nr,_Afg07,$BN$285)*L152,IF(AND(VLOOKUP(Alt2nr,_Afg07,$BU$285)=1,$CX$5=4),0,IF($CX$7=1,-VLOOKUP(Alt2nr,_Afg07,$BN$285)*L152,-VLOOKUP(Alt2nr,_Afg07,$BO$285)*L152)))),\"\")","v":""},{"$f":"IF(L170<>\"\",\"kr.\",\"\")","v":""},null,null,null,null,null,{"$f":"B170","v":"Tørring (korn i eget tørreri)"},null,null,null,null,null,null,null,null,null,null,null,null,null,null,null,null,null,null,null,null,null,null,null,null,null,null,null,null,null,null,null,null,null,null,null,null,null,null,null,null,null,null,null,null,null,null,null,null,null,null,null,null,null,null,null,null,null,null,null,null,null,null,null,null,null,null,null,null,null,null,{"$f":"IF(CM170=0,\"\",_xlfn.CONCAT(CM170,\" \",\"(\",CO170,\"ha\",\")\"))","v":""},{"$f":"IF(CN170=\"Egen afgrøde\",$C$43,CN170)","v":0},{"$f":"IF(CR170=$CM$151,0,IF(CR170=$CM$152,0,IF(CR170=$CM$153,0,CR170)))","v":0},{"$f":"IF(CR170=$CM$151,0,IF(CR170=$CM$152,0,IF(CR170=$CM$153,0,CS170)))","v":0},null,null,{"$f":"VLOOKUP(CU162,$R$288:$S$342,2)","v":0},{"$f":"D91","v":0},null,1,null,{"$f":"IF(CU170>1,IF(VLOOKUP(CU170,_Afg07,$BU$285)=2,IF($CU$9=2,-VLOOKUP($R$324,_Afg07,$CV$9)*Erstatpris*D99,0),0),0)","v":0},{"$f":"IF(AND(CU170>1,VLOOKUP(CU170,_Afg07,$BU$285)=1),IF(F99<>\"\",F99,G99)*D99,0)","v":0},{"$f":"IF(AND(CU170>1,VLOOKUP(CU170,_Afg07,$BU$285)=1),D99,0)","v":0},null,null,{"$f":"IF(AND(CU170>1,VLOOKUP(CU170,_Afg07,$BU$285)=1),VLOOKUP(CU170,_Afg07,Halmnr)*D99,0)","v":0},null,null,null,1,null,null,null,null,null,null,null,true,null,false,null,true,null,false,null,{"$f":"IF(VLOOKUP($CU170,_Afg07,$BV$285)=1,IF($DN170,$D99/IF(_Plo2<>\"\",_Plo2,Plo),0),0)","v":0},{"$f":"IF(VLOOKUP($CU170,_Afg07,$BV$285)=2,IF($DN170,$D99/IF(_Plo2<>\"\",_Plo2,Plo),0),0)","v":0},{"$f":"IF(VLOOKUP($CU170,_Afg07,$BV$285)=3,IF($DN170,$D99/IF(_Plo2<>\"\",_Plo2,Plo),0),0)","v":0},{"$f":"IF(VLOOKUP($CU170,_Afg07,$BZ$285)=1,IF($DP170,$D99/IF(_Stu2<>\"\",_Stu2,Stu),0),0)","v":0},{"$f":"IF(VLOOKUP($CU170,_Afg07,$BZ$285)=2,IF($DP170,$D99/IF(_Stu2<>\"\",_Stu2,Stu),0),0)","v":0},{"$f":"IF(VLOOKUP($CU170,_Afg07,$BZ$285)=3,IF($DP170,$D99/IF(_Stu2<>\"\",_Stu2,Stu),0),0)","v":0},{"$f":"IF(VLOOKUP($CU170,_Afg07,$BW$285)=1,IF($DR170,$D99/IF(Såb2<>\"\",Såb2,Såb),0),0)","v":0},{"$f":"IF(VLOOKUP($CU170,_Afg07,$BW$285)=2,IF($DR170,$D99/IF(Såb2<>\"\",Såb2,Såb),0),0)","v":0},{"$f":"IF(VLOOKUP($CU170,_Afg07,$BW$285)=3,IF($DR170,$D99/IF(Såb2<>\"\",Såb2,Såb),0),0)","v":0},{"$f":"IF(VLOOKUP($CU170,_Afg07,$BX$285)=1,IF($DT170,$D99/IF(_Gly2<>\"\",_Gly2,Gly),0),0)","v":0},{"$f":"IF(VLOOKUP($CU170,_Afg07,$BX$285)=2,IF($DT170,$D99/IF(_Gly2<>\"\",_Gly2,Gly),0),0)","v":0},{"$f":"IF(VLOOKUP($CU170,_Afg07,$BX$285)=3,IF($DT170,$D99/IF(_Gly2<>\"\",_Gly2,Gly),0),0)","v":0},{"$f":"IF(VLOOKUP($CU170,_Afg07,$BY$285)=1,$D99/IF(Såm2<>\"\",Såm2,Såm),0)","v":0},{"$f":"IF(VLOOKUP($CU170,_Afg07,$BY$285)=2,$D99/IF(Såm2<>\"\",Såm2,Såm),0)","v":0},{"$f":"IF(VLOOKUP($CU170,_Afg07,$BY$285)=3,$D99/IF(Såm2<>\"\",Såm2,Såm),0)","v":0},{"$f":"IF(VLOOKUP($CU170,_Afg07,$CA$285)=1,$D99/IF(_Mej2<>\"\",_Mej2,Mej)*VLOOKUP($CU170,_Afg07,$CC$285),0)","v":0},{"$f":"IF(VLOOKUP($CU170,_Afg07,$CA$285)=2,$D99/IF(_Mej2<>\"\",_Mej2,Mej)*VLOOKUP($CU170,_Afg07,$CC$285),0)","v":0},{"$f":"IF(VLOOKUP($CU170,_Afg07,$CA$285)=3,$D99/IF(_Mej2<>\"\",_Mej2,Mej)*VLOOKUP($CU170,_Afg07,$CC$285),0)","v":0},{"$f":"IF(HalmJa=1,IF(VLOOKUP($CU170,_Afg07,$CB$285)=1,$D99/IF(_Hal3<>\"\",_Hal3,Hal)+$D99/_Hal2,0),0)","v":0},{"$f":"IF(HalmJa=1,IF(VLOOKUP($CU170,_Afg07,$CB$285)=2,$D99/IF(_Hal3<>\"\",_Hal3,Hal)+$D99/_Hal2,0),0)","v":0},{"$f":"IF(VLOOKUP($CU170,_Afg07,$CD$285)=1,$D99/IF(_Enk2<>\"\",_Enk2,Enk),0)","v":0},{"$f":"IF(VLOOKUP($CU170,_Afg07,$CE$285)=1,$D99/IF(_Kar2<>\"\",_Kar2,Kar),0)","v":0},{"$f":"IF(VLOOKUP($CU170,_Afg07,$CF$285)=1,$D99/IF(Kopt2<>\"\",Kopt2,Kopt),0)","v":0},{"$f":"IF(VLOOKUP($CU170,_Afg07,$CG$285)=1,$D99/IF(Ropt2<>\"\",Ropt2,Ropt),0)","v":0},{"$f":"VLOOKUP($CU170,_Afg07,$CH$285)*$D99/IF(_Gly2<>\"\",_Gly2,Gly)","v":0},{"$f":"VLOOKUP($CU170,_Afg07,$CI$285)*$D99/IF(Gød2<>\"\",Gød2,Gød)","v":0}]
[null,{"$f":"IF(Købernr=2,\"Erstatningskorn\",\"\")","v":""},null,{"$f":"IF(CU139>1,IF($CU$9=2,IF(VLOOKUP(CU139,_Afg07,BU285)=2,(-VLOOKUP($R$324,_Afg07,$CV$9)*Erstatpris),IF(VLOOKUP(CU139,_Afg07,BU285)=3,$CW$173,IF(VLOOKUP(CU139,_Afg07,BU285)=4,$CW$174,\"\"))),\"\"),\"\")","v":""},{"$f":"IF(D171<>\"\",\"kr.\",\"\")","v":""},null,null,{"$f":"IF(CV139>1,IF($CU$9=2,IF(VLOOKUP(CV139,_Afg07,BU285)=2,(-VLOOKUP($R$324,_Afg07,$CV$9)*Erstatpris),IF(VLOOKUP(CV139,_Afg07,BU285)=3,$CW$173,IF(VLOOKUP(CV139,_Afg07,BU285)=4,$CW$174,\"\"))),\"\"),\"\")","v":""},{"$f":"IF(H171<>\"\",\"kr.\",\"\")","v":""},null,null,{"$f":"IF(CW139>1,IF($CU$9=2,IF(VLOOKUP(CW139,_Afg07,BU285)=2,(-VLOOKUP($R$324,_Afg07,$CV$9)*Erstatpris),IF(VLOOKUP(CW139,_Afg07,BU285)=3,$CW$173,IF(VLOOKUP(CW139,_Afg07,BU285)=4,$CW$174,\"\"))),\"\"),\"\")","v":""},{"$f":"IF(L171<>\"\",\"kr.\",\"\")","v":""},null,null,null,null,null,null,{"$f":"IF(OR(T169>0,T170>0),\"Husk minus foran\",\"\")","v":""},null,{"$f":"IF(OR(V169>0,V170>0),\"Husk minus foran\",\"\")","v":""},null,{"$f":"IF(OR(X169>0,X170>0),\"Husk minus foran\",\"\")","v":""},null,null,null,null,null,null,null,null,null,null,null,null,null,null,null,null,null,null,null,null,null,null,null,null,null,null,null,null,null,null,null,null,null,null,null,null,null,null,null,null,null,null,null,null,null,null,null,null,null,null,null,null,null,null,null,null,null,null,null,null,null,null,null,null,null,"",0,0,0,null,null,{"$f":"VLOOKUP(CU164,$R$288:$S$342,2)","v":0},{"$f":"D93","v":0},null,1,null,{"$f":"IF(CU171>1,IF(VLOOKUP(CU171,_Afg07,$BU$285)=2,IF($CU$9=2,-VLOOKUP($R$324,_Afg07,$CV$9)*Erstatpris*D80,0),0),0)","v":0},{"$f":"IF(AND(CU171>1,VLOOKUP(CU171,_Afg07,$BU$285)=1),IF(F80<>\"\",F80,G80)*D80,0)","v":0},{"$f":"IF(AND(CU171>1,VLOOKUP(CU171,_Afg07,$BU$285)=1),D80,0)","v":0},null,null,{"$f":"IF(AND(CU171>1,VLOOKUP(CU171,_Afg07,$BU$285)=1),VLOOKUP(CU171,_Afg07,Halmnr)*D80,0)","v":0},null,null,null,2,"Planlager",null,null,null,null,null,null,true,null,false,null,true,null,false,null,{"$f":"IF(VLOOKUP($CU171,_Afg07,$BV$285)=1,IF($DN171,$D80/IF(_Plo2<>\"\",_Plo2,Plo),0),0)","v":0},{"$f":"IF(VLOOKUP($CU171,_Afg07,$BV$285)=2,IF($DN171,$D80/IF(_Plo2<>\"\",_Plo2,Plo),0),0)","v":0},{"$f":"IF(VLOOKUP($CU171,_Afg07,$BV$285)=3,IF($DN171,$D80/IF(_Plo2<>\"\",_Plo2,Plo),0),0)","v":0},{"$f":"IF(VLOOKUP($CU171,_Afg07,$BZ$285)=1,IF($DP171,$D80/IF(_Stu2<>\"\",_Stu2,Stu),0),0)","v":0},{"$f":"IF(VLOOKUP($CU171,_Afg07,$BZ$285)=2,IF($DP171,$D80/IF(_Stu2<>\"\",_Stu2,Stu),0),0)","v":0},{"$f":"IF(VLOOKUP($CU171,_Afg07,$BZ$285)=3,IF($DP171,$D80/IF(_Stu2<>\"\",_Stu2,Stu),0),0)","v":0},{"$f":"IF(VLOOKUP($CU171,_Afg07,$BW$285)=1,IF($DR171,$D80/IF(Såb2<>\"\",Såb2,Såb),0),0)","v":0},{"$f":"IF(VLOOKUP($CU171,_Afg07,$BW$285)=2,IF($DR171,$D80/IF(Såb2<>\"\",Såb2,Såb),0),0)","v":0},{"$f":"IF(VLOOKUP($CU171,_Afg07,$BW$285)=3,IF($DR171,$D80/IF(Såb2<>\"\",Såb2,Såb),0),0)","v":0},{"$f":"IF(VLOOKUP($CU171,_Afg07,$BX$285)=1,IF($DT171,$D80/IF(_Gly2<>\"\",_Gly2,Gly),0),0)","v":0},{"$f":"IF(VLOOKUP($CU171,_Afg07,$BX$285)=2,IF($DT171,$D80/IF(_Gly2<>\"\",_Gly2,Gly),0),0)","v":0},{"$f":"IF(VLOOKUP($CU171,_Afg07,$BX$285)=3,IF($DT171,$D80/IF(_Gly2<>\"\",_Gly2,Gly),0),0)","v":0},{"$f":"IF(VLOOKUP($CU171,_Afg07,$BY$285)=1,$D80/IF(Såm2<>\"\",Såm2,Såm),0)","v":0},{"$f":"IF(VLOOKUP($CU171,_Afg07,$BY$285)=2,$D80/IF(Såm2<>\"\",Såm2,Såm),0)","v":0},{"$f":"IF(VLOOKUP($CU171,_Afg07,$BY$285)=3,$D80/IF(Såm2<>\"\",Såm2,Såm),0)","v":0},{"$f":"IF(VLOOKUP($CU171,_Afg07,$CA$285)=1,$D80/IF(_Mej2<>\"\",_Mej2,Mej)*VLOOKUP($CU171,_Afg07,$CC$285),0)","v":0},{"$f":"IF(VLOOKUP($CU171,_Afg07,$CA$285)=2,$D80/IF(_Mej2<>\"\",_Mej2,Mej)*VLOOKUP($CU171,_Afg07,$CC$285),0)","v":0},{"$f":"IF(VLOOKUP($CU171,_Afg07,$CA$285)=3,$D80/IF(_Mej2<>\"\",_Mej2,Mej)*VLOOKUP($CU171,_Afg07,$CC$285),0)","v":0},{"$f":"IF(HalmJa=1,IF(VLOOKUP($CU171,_Afg07,$CB$285)=1,$D80/IF(_Hal3<>\"\",_Hal3,Hal)+$D80/_Hal2,0),0)","v":0},{"$f":"IF(HalmJa=1,IF(VLOOKUP($CU171,_Afg07,$CB$285)=2,$D80/IF(_Hal3<>\"\",_Hal3,Hal)+$D80/_Hal2,0),0)","v":0},{"$f":"IF(VLOOKUP($CU171,_Afg07,$CD$285)=1,$D80/IF(_Enk2<>\"\",_Enk2,Enk),0)","v":0},{"$f":"IF(VLOOKUP($CU171,_Afg07,$CE$285)=1,$D80/IF(_Kar2<>\"\",_Kar2,Kar),0)","v":0},{"$f":"IF(VLOOKUP($CU171,_Afg07,$CF$285)=1,$D80/IF(Kopt2<>\"\",Kopt2,Kopt),0)","v":0},{"$f":"IF(VLOOKUP($CU171,_Afg07,$CG$285)=1,$D80/IF(Ropt2<>\"\",Ropt2,Ropt),0)","v":0},{"$f":"VLOOKUP($CU171,_Afg07,$CH$285)*$D80/IF(_Gly2<>\"\",_Gly2,Gly)","v":0},{"$f":"VLOOKUP($CU171,_Afg07,$CI$285)*$D80/IF(Gød2<>\"\",Gød2,Gød)","v":0}]
[null,null,null,null,null,null,null,null,null,null,null,null,null,null,null,null,null,null,null,null,null,null,null,null,null,null,null,null,null,null,null,null,null,null,null,null,null,null,null,null,null,null,null,null,null,null,null,null,null,null,null,null,null,null,null,null,null,null,null,null,null,null,null,null,null,null,null,null,null,null,null,null,null,null,null,null,null,null,null,null,null,null,null,null,null,null,null,null,null,"",0,0,0,null,null,{"$f":"VLOOKUP(CU166,$R$288:$S$342,2)","v":0},{"$f":"D95","v":0},null,1,null,{"$f":"IF(CU172>1,IF(VLOOKUP(CU172,_Afg07,$BU$285)=2,IF($CU$9=2,-VLOOKUP($R$324,_Afg07,$CV$9)*Erstatpris*D101,0),0),0)","v":0},{"$f":"IF(AND(CU172>1,VLOOKUP(CU172,_Afg07,$BU$285)=1),IF(F101<>\"\",F101,G101)*D101,0)","v":0},{"$f":"IF(AND(CU172>1,VLOOKUP(CU172,_Afg07,$BU$285)=1),D101,0)","v":0},"Kornudbytte i gns pr. ha af alle ha i sædskiftet","Udbytte foderkorn i gns pr. ha med foderkorn",{"$f":"IF(AND(CU172>1,VLOOKUP(CU172,_Afg07,$BU$285)=1),VLOOKUP(CU172,_Afg07,Halmnr)*D101,0)","v":0},null,null,null,3,"Stålsilo",null,null,null,null,null,null,true,null,false,null,true,null,false,null,{"$f":"IF(VLOOKUP($CU172,_Afg07,$BV$285)=1,IF($DN172,$D101/IF(_Plo2<>\"\",_Plo2,Plo),0),0)","v":0},{"$f":"IF(VLOOKUP($CU172,_Afg07,$BV$285)=2,IF($DN172,$D101/IF(_Plo2<>\"\",_Plo2,Plo),0),0)","v":0},{"$f":"IF(VLOOKUP($CU172,_Afg07,$BV$285)=3,IF($DN172,$D101/IF(_Plo2<>\"\",_Plo2,Plo),0),0)","v":0},{"$f":"IF(VLOOKUP($CU172,_Afg07,$BZ$285)=1,IF($DP172,$D101/IF(_Stu2<>\"\",_Stu2,Stu),0),0)","v":0},{"$f":"IF(VLOOKUP($CU172,_Afg07,$BZ$285)=2,IF($DP172,$D101/IF(_Stu2<>\"\",_Stu2,Stu),0),0)","v":0},{"$f":"IF(VLOOKUP($CU172,_Afg07,$BZ$285)=3,IF($DP172,$D101/IF(_Stu2<>\"\",_Stu2,Stu),0),0)","v":0},{"$f":"IF(VLOOKUP($CU172,_Afg07,$BW$285)=1,IF($DR172,$D101/IF(Såb2<>\"\",Såb2,Såb),0),0)","v":0},{"$f":"IF(VLOOKUP($CU172,_Afg07,$BW$285)=2,IF($DR172,$D101/IF(Såb2<>\"\",Såb2,Såb),0),0)","v":0},{"$f":"IF(VLOOKUP($CU172,_Afg07,$BW$285)=3,IF($DR172,$D101/IF(Såb2<>\"\",Såb2,Såb),0),0)","v":0},{"$f":"IF(VLOOKUP($CU172,_Afg07,$BX$285)=1,IF($DT172,$D101/IF(_Gly2<>\"\",_Gly2,Gly),0),0)","v":0},{"$f":"IF(VLOOKUP($CU172,_Afg07,$BX$285)=2,IF($DT172,$D101/IF(_Gly2<>\"\",_Gly2,Gly),0),0)","v":0},{"$f":"IF(VLOOKUP($CU172,_Afg07,$BX$285)=3,IF($DT172,$D101/IF(_Gly2<>\"\",_Gly2,Gly),0),0)","v":0},{"$f":"IF(VLOOKUP($CU172,_Afg07,$BY$285)=1,$D101/IF(Såm2<>\"\",Såm2,Såm),0)","v":0},{"$f":"IF(VLOOKUP($CU172,_Afg07,$BY$285)=2,$D101/IF(Såm2<>\"\",Såm2,Såm),0)","v":0},{"$f":"IF(VLOOKUP($CU172,_Afg07,$BY$285)=3,$D101/IF(Såm2<>\"\",Såm2,Såm),0)","v":0},{"$f":"IF(VLOOKUP($CU172,_Afg07,$CA$285)=1,$D101/IF(_Mej2<>\"\",_Mej2,Mej)*VLOOKUP($CU172,_Afg07,$CC$285),0)","v":0},{"$f":"IF(VLOOKUP($CU172,_Afg07,$CA$285)=2,$D101/IF(_Mej2<>\"\",_Mej2,Mej)*VLOOKUP($CU172,_Afg07,$CC$285),0)","v":0},{"$f":"IF(VLOOKUP($CU172,_Afg07,$CA$285)=3,$D101/IF(_Mej2<>\"\",_Mej2,Mej)*VLOOKUP($CU172,_Afg07,$CC$285),0)","v":0},{"$f":"IF(HalmJa=1,IF(VLOOKUP($CU172,_Afg07,$CB$285)=1,$D101/IF(_Hal3<>\"\",_Hal3,Hal)+$D101/_Hal2,0),0)","v":0},{"$f":"IF(HalmJa=1,IF(VLOOKUP($CU172,_Afg07,$CB$285)=2,$D101/IF(_Hal3<>\"\",_Hal3,Hal)+$D101/_Hal2,0),0)","v":0},{"$f":"IF(VLOOKUP($CU172,_Afg07,$CD$285)=1,$D101/IF(_Enk2<>\"\",_Enk2,Enk),0)","v":0},{"$f":"IF(VLOOKUP($CU172,_Afg07,$CE$285)=1,$D101/IF(_Kar2<>\"\",_Kar2,Kar),0)","v":0},{"$f":"IF(VLOOKUP($CU172,_Afg07,$CF$285)=1,$D101/IF(Kopt2<>\"\",Kopt2,Kopt),0)","v":0},{"$f":"IF(VLOOKUP($CU172,_Afg07,$CG$285)=1,$D101/IF(Ropt2<>\"\",Ropt2,Ropt),0)","v":0},{"$f":"VLOOKUP($CU172,_Afg07,$CH$285)*$D101/IF(_Gly2<>\"\",_Gly2,Gly)","v":0},{"$f":"VLOOKUP($CU172,_Afg07,$CI$285)*$D101/IF(Gød2<>\"\",Gød2,Gød)","v":0}]
[null,"Resultat",null,{"$f":"IF(Afgnr>1,IF(D171=\"\",D167+D169+D170,D167+D169+D170+D171),\"\")","v":""},{"$f":"IF(D173<>\"\",\"kr.\",\"\")","v":""},null,null,{"$f":"IF(Alt1nr>1,IF(H171=\"\",H167+H169+H170,H167+H169+H170+H171),\"\")","v":""},{"$f":"IF(H173<>\"\",\"kr.\",\"\")","v":""},null,null,{"$f":"IF(Alt2nr>1,IF(L171=\"\",L167+L169+L170,L167+L169+L170+L171),\"\")","v":""},{"$f":"IF(L173<>\"\",\"kr.\",\"\")","v":""},null,null,null,null,null,null,null,null,null,null,null,null,null,null,null,null,null,null,null,null,null,null,null,null,null,null,null,null,null,null,null,null,null,null,null,null,null,null,null,null,null,null,null,null,null,null,null,null,null,null,null,null,null,null,null,null,null,null,null,null,null,null,null,null,null,null,null,null,null,null,null,null,null,null,null,null,"",0,0,0,null,null,{"$f":"VLOOKUP(CU168,$R$288:$S$342,2)","v":0},{"$f":"D97","v":0},null,null,"Erstatkorn 1, gns.",{"$f":"(CW159+CW161+CW163+CW165+CW167+CW169+CW171)/D82","v":{"$error":"#DIV/0!"}},{"$f":"CX159+CX161+CX163+CX165+CX167+CX169+CX171","v":0},{"$f":"CY159+CY161+CY163+CY165+CY167+CY169+CY171","v":0},{"$f":"CX173/D82","v":{"$error":"#DIV/0!"}},{"$f":"CX173/CY173","v":{"$error":"#DIV/0!"}},{"$f":"DB159+DB161+DB163+DB165+DB167+DB169+DB171","v":0},null,null,null,4,"Gastæt silo",null,null,null,null,null,null,null,null,null,null,null,null,null,"Sædskifte 1",{"$f":"DV159+DV161+DV163+DV165+DV167+DV169+DV171","v":0},{"$f":"DW159+DW161+DW163+DW165+DW167+DW169+DW171","v":0},0,0,0,0,0,0,0,0,0,0,0,0,0,0,0,0,0,0,{"$f":"EP159+EP161+EP163+EP165+EP167+EP169+EP171","v":0},0,0,0,0,0,{"$f":"D82*DE_ha*ton_DE/IF(_Gyl2<>\"\",_Gyl2,Gyl)","v":0}]
[null,null,null,null,null,null,null,null,null,null,null,null,null,null,null,null,null,null,null,null,null,null,null,null,null,null,null,null,null,null,null,null,null,null,null,null,null,null,null,null,null,null,null,null,null,null,null,null,null,null,null,null,null,null,null,null,null,null,null,null,null,null,null,null,null,null,null,null,null,null,null,null,null,null,null,null,null,null,null,null,null,null,null,null,null,null,null,null,null,"",0,0,0,null,null,{"$f":"VLOOKUP(CU170,$R$288:$S$342,2)","v":0},{"$f":"D99","v":0},null,null,"Erstatkorn 2, gns.",{"$f":"(CW160+CW162+CW164+CW166+CW168+CW170+CW172)/D103","v":{"$error":"#DIV/0!"}},{"$f":"CX160+CX162+CX164+CX166+CX168+CX170+CX172","v":0},{"$f":"CY160+CY162+CY164+CY166+CY168+CY170+CY172","v":0},{"$f":"CX174/D103","v":{"$error":"#DIV/0!"}},{"$f":"CX174/CY174","v":{"$error":"#DIV/0!"}},{"$f":"DB160+DB162+DB164+DB166+DB168+DB170+DB172","v":0},null,null,null,null,null,null,null,null,null,null,null,null,null,null,null,null,null,null,"Sædskifte 2",{"$f":"DV160+DV162+DV164+DV166+DV168+DV170+DV172","v":0},{"$f":"DW160+DW162+DW164+DW166+DW168+DW170+DW172","v":0},0,0,0,0,0,0,0,0,0,0,0,0,0,0,0,0,0,0,0,0,0,0,0,0,{"$f":"D103*DE_ha*ton_DE/IF(_Gyl2<>\"\",_Gyl2,Gyl)","v":0}]
[null,null,null,null,null,null,null,null,null,null,null,null,null,null,null,null,null,null,null,null,null,null,null,null,null,null,null,null,null,null,null,null,null,null,null,null,null,null,null,null,null,null,null,null,null,null,null,null,null,null,null,null,null,null,null,null,null,null,null,null,null,null,null,null,null,null,null,null,null,null,null,null,null,null,null,null,null,null,null,null,null,null,null,null,null,null,null,null,null,"",0,0,0,null,null,{"$f":"VLOOKUP(CU172,$R$288:$S$342,2)","v":0},{"$f":"D101","v":0},null,null,null,null,null,null,null,null,null,null,null,null,null,"Tørring korn"]
[null,"Ligevægtspris",null,null,null,null,null,{"$f":"IF(ISERROR(IF(AND(CV139>1,CV139<R340,CU139>1),(($D$173-H173)/H152)+H153,\"\")),\"\",IF(AND(CV139>1,CV139<R340,CU139>1),(($D$173-H173)/H152)+H153,\"\"))","v":""},{"$f":"IF(H176<>\"\",\"kr.\",\"\")","v":""},null,null,{"$f":"IF(ISERROR(IF(AND(CW139>1,CW139<R340,CU139>1),(($D$173-L173)/L152)+L153,\"\")),\"\",IF(AND(CW139>1,CW139<R340,CU139>1),(($D$173-L173)/L152)+L153,\"\"))","v":""},{"$f":"IF(L176<>\"\",\"kr.\",\"\")","v":""},null,null,null,null,null,null,null,null,null,null,null,null,null,null,null,null,null,null,null,null,null,null,null,null,null,null,null,null,null,null,null,null,null,null,null,null,null,null,null,null,null,null,null,null,null,null,null,null,null,null,null,null,null,null,null,null,null,null,null,null,null,null,null,null,null,null,null,null,null,null,null,null,null,null,null,null,null,null,null,null,null,null,null,null,null,null,null,null,null,null,null,null,null,null,null,null,1,"Løntørring",null,null,null,null,null,null,null,null,null,null,null,null,null,null,"Forår","August","Sept","Juli","August","Oktober","Forår","August","Sept","Forår","August","Sept","Forår","August","Sept","Juli","August","Oktober","Juli","August","Forår","Forår","Sept.","Oktober","Hele året","Hele året","Hele året"]
[null,"Ligevægtsudbytte",null,null,null,null,null,{"$f":"IF(ISERROR(IF(AND(CV139>1,CV139<R340,CU139>1),(($D$173-H173)/H153)+H152,\"\")),\"\",IF(AND(CV139>1,CV139<R340,CU139>1),(($D$173-H173)/H153)+H152,\"\"))","v":""},{"$f":"IF(H177<>\"\",VLOOKUP(CV139,_Afg07,3),\"\")","v":""},null,null,{"$f":"IF(ISERROR(IF(AND(CW139>1,CW139<R340,CU139>1),(($D$173-L173)/L153)+L152,\"\")),\"\",IF(AND(CW139>1,CW139<R340,CU139>1),(($D$173-L173)/L153)+L152,\"\"))","v":""},{"$f":"IF(L177<>\"\",VLOOKUP(CW139,_Afg07,3),\"\")","v":""},null,null,null,null,null,null,null,null,null,null,null,null,null,null,null,null,null,null,null,null,null,null,null,null,null,null,null,null,null,null,null,null,null,null,null,null,null,null,null,null,null,null,null,null,null,null,null,null,null,null,null,null,null,null,null,null,null,null,null,null,null,null,null,null,null,null,null,null,null,null,null,null,null,null,null,null,null,null,null,null,null,null,null,null,null,null,null,null,null,null,null,null,null,null,null,null,2,"Eget tørreri"]
[null,null,null,null,null,null,null,null,null,null,null,null,null,null,null,null,null,null,null,null,null,null,null,null,null,null,null,null,null,null,null,null,null,null,null,null,null,null,null,null,null,null,null,null,null,null,null,null,null,null,null,null,null,null,null,null,null,null,null,null,null,null,null,null,null,null,null,null,null,null,null,null,null,null,null,null,null,null,null,null,null,null,null,null,null,null,null,null,null,null,null,null,null,null,null,null,null,null,null,"Jordtyper"]
[null,null,null,null,null,null,null,null,null,null,null,null,null,null,null,null,null,null,null,null,null,null,null,null,null,null,null,null,null,null,null,null,null,null,null,null,null,null,null,null,null,null,null,null,null,null,null,null,null,null,null,null,null,null,null,null,null,null,null,null,null,null,null,null,null,null,null,null,null,null,null,null,null,null,null,null,null,null,null,null,null,null,null,null,null,null,null,null,null,null,null,null,null,null,null,null,null,null,null,1,"JB 1+3",null,null,null,null,null,null,null,null,null,"Foderenheder"]
[null,{"$f":"IF(FEnr=1,\"Foderenheder pr. ha\",\"\")","v":""},null,{"$f":"IF(AND(Afgnr>1,FEnr=1),IF(VLOOKUP(Afgnr,_Afg07,$BU$285)=1,D152*VLOOKUP(Afgnr,_Afg07,$BT$285),IF(VLOOKUP(Afgnr,_Afg07,$BU$285)=3,$CZ$173*VLOOKUP(1,Foderkorn,$BT$285),IF(VLOOKUP(Afgnr,_Afg07,$BU$285)=4,$CZ$174*VLOOKUP(2,Foderkorn,$BT$285),\"\"))),\"\")","v":""},{"$f":"IF(D180<>\"\",\"FEsv\",\"\")","v":""},null,null,{"$f":"IF(AND(Alt1nr>1,FEnr=1),IF(VLOOKUP(Alt1nr,_Afg07,$BU$285)=1,H152*VLOOKUP(Alt1nr,_Afg07,$BT$285),IF(VLOOKUP(Alt1nr,_Afg07,$BU$285)=3,$CZ$173*VLOOKUP(1,Foderkorn,$BT$285),IF(VLOOKUP(Alt1nr,_Afg07,$BU$285)=4,$CZ$174*VLOOKUP(2,Foderkorn,$BT$285),\"\"))),\"\")","v":""},{"$f":"IF(H180<>\"\",\"FEsv\",\"\")","v":""},null,null,{"$f":"IF(AND(Alt2nr>1,FEnr=1),IF(VLOOKUP(Alt2nr,_Afg07,$BU$285)=1,L152*VLOOKUP(Alt2nr,_Afg07,$BT$285),IF(VLOOKUP(Alt2nr,_Afg07,$BU$285)=3,$CZ$173*VLOOKUP(1,Foderkorn,$BT$285),IF(VLOOKUP(Alt2nr,_Afg07,$BU$285)=4,$CZ$174*VLOOKUP(2,Foderkorn,$BT$285),\"\"))),\"\")","v":""},{"$f":"IF(L180<>\"\",\"FEsv\",\"\")","v":""},null,null,null,null,null,null,null,null,null,null,null,null,null,null,null,null,null,null,null,null,null,null,null,null,null,null,null,null,null,null,null,null,null,null,null,null,null,null,null,null,null,null,null,null,null,null,null,null,null,null,null,null,null,null,null,null,null,null,null,null,null,null,null,null,null,null,null,null,null,null,null,null,null,null,null,null,null,null,null,null,null,null,null,null,null,null,2,"JB 2+4",null,null,null,null,null,null,null,null,1,"Vis"]
[null,{"$f":"IF(OR(Lagernr=1,FEnr=2),\"\",IF(Lagernr=BQ285,\"Lager (planlager)\",IF(Lagernr=BR285,\"Lager (stålsilo)\",\"Lager (gastæt silo)\")))","v":""},null,{"$f":"IF(AND(Afgnr>1,FEnr=1,Lagernr<>1),IF(VLOOKUP(Afgnr,_Afg07,$BU$285)=1,-D152*VLOOKUP(Afgnr,_Afg07,Lagernr)/D180,IF(VLOOKUP(Afgnr,_Afg07,$BU$285)=3,-$CZ$173*VLOOKUP(1,Foderkorn,Lagernr)/D180,IF(VLOOKUP(Afgnr,_Afg07,$BU$285)=4,-$CZ$174*VLOOKUP(2,Foderkorn,Lagernr)/D180,\"\"))),\"\")","v":""},{"$f":"IF(D181<>\"\",\"kr./FEsv\",\"\")","v":""},null,null,{"$f":"IF(AND(Alt1nr>1,FEnr=1,Lagernr<>1),IF(VLOOKUP(Alt1nr,_Afg07,$BU$285)=1,-H152*VLOOKUP(Alt1nr,_Afg07,Lagernr)/H180,IF(VLOOKUP(Alt1nr,_Afg07,$BU$285)=3,-$CZ$173*VLOOKUP(1,Foderkorn,Lagernr)/H180,IF(VLOOKUP(Alt1nr,_Afg07,$BU$285)=4,-$CZ$174*VLOOKUP(2,Foderkorn,Lagernr)/H180,\"\"))),\"\")","v":""},{"$f":"IF(H181<>\"\",\"kr./FEsv\",\"\")","v":""},null,null,{"$f":"IF(AND(Alt2nr>1,FEnr=1,Lagernr<>1),IF(VLOOKUP(Alt2nr,_Afg07,$BU$285)=1,-L152*VLOOKUP(Alt2nr,_Afg07,Lagernr)/L180,IF(VLOOKUP(Alt2nr,_Afg07,$BU$285)=3,-$CZ$173*VLOOKUP(1,Foderkorn,Lagernr)/L180,IF(VLOOKUP(Alt2nr,_Afg07,$BU$285)=4,-$CZ$174*VLOOKUP(2,Foderkorn,Lagernr)/L180,\"\"))),\"\")","v":""},{"$f":"IF(L181<>\"\",\"kr./FEsv\",\"\")","v":""},null,null,null,null,null,null,null,null,null,null,null,null,null,null,null,null,null,null,null,null,null,null,null,null,null,null,null,null,null,null,null,null,null,null,null,null,null,null,null,null,null,null,null,null,null,null,null,null,null,null,null,null,null,null,null,null,null,null,null,null,null,null,null,null,null,null,null,null,null,null,null,null,null,null,null,null,null,null,null,null,null,null,null,null,null,null,3,"JB 1-4 vandet",null,null,null,null,null,null,null,null,2,"Vis ikke"]
[null,{"$f":"IF(AND(FEnr=1,Lagernr<>1),\"Omkostninger ab lager\",\"\")","v":""},null,{"$f":"IF(AND(Afgnr>1,FEnr=1,Lagernr<>1,VLOOKUP(Afgnr,_Afg07,$BU$285,)=1),(D165+D169+D170)/D180+D181,IF(AND(Afgnr>1,FEnr=1,Lagernr<>1,VLOOKUP(Afgnr,_Afg07,$BU$285,)=3),-D$607*$CY$173/$D$82/D$180+D181,IF(AND(Afgnr>1,FEnr=1,Lagernr<>1,VLOOKUP(Afgnr,_Afg07,$BU$285,)=4),-D$607*$CY$174/$D$103/D$180+D181,\"\")))","v":""},{"$f":"IF(D182<>\"\",\"kr./FEsv\",\"\")","v":""},null,null,{"$f":"IF(AND(Alt1nr>1,FEnr=1,Lagernr<>1,VLOOKUP(Alt1nr,_Afg07,$BU$285,)=1),(H165+H169+H170)/H180+H181,IF(AND(Alt1nr>1,FEnr=1,Lagernr<>1,VLOOKUP(Alt1nr,_Afg07,$BU$285,)=3),-H$607*$CY$173/$D$82/H$180+H181,IF(AND(Alt1nr>1,FEnr=1,Lagernr<>1,VLOOKUP(Alt1nr,_Afg07,$BU$285,)=4),-H$607*$CY$174/$D$103/H$180+H181,\"\")))","v":""},{"$f":"IF(H182<>\"\",\"kr./FEsv\",\"\")","v":""},null,null,{"$f":"IF(AND(Alt2nr>1,FEnr=1,Lagernr<>1,VLOOKUP(Alt2nr,_Afg07,$BU$285,)=1),(L165+L169+L170)/L180+L181,IF(AND(Alt2nr>1,FEnr=1,Lagernr<>1,VLOOKUP(Alt2nr,_Afg07,$BU$285,)=3),-L$607*$CY$173/$D$82/L$180+L181,IF(AND(Alt2nr>1,FEnr=1,Lagernr<>1,VLOOKUP(Alt2nr,_Afg07,$BU$285,)=4),-L$607*$CY$174/$D$103/L$180+L181,\"\")))","v":""},{"$f":"IF(L182<>\"\",\"kr./FEsv\",\"\")","v":""},null,null,null,null,null,null,null,null,null,null,null,null,null,null,null,null,null,null,null,null,null,null,null,null,null,null,null,null,null,null,null,null,null,null,null,null,null,null,null,null,null,null,null,null,null,null,null,null,null,null,null,null,null,null,null,null,null,null,null,null,null,null,null,null,null,null,null,null,null,null,null,null,null,null,null,null,null,null,null,null,null,null,null,null,null,null,4,"JB 5-6"]
[null,null,null,null,null,null,null,null,null,null,null,null,null,null,null,null,null,null,null,null,null,null,null,null,null,null,null,null,null,null,null,null,null,null,null,null,null,null,null,null,null,null,null,null,null,null,null,null,null,null,null,null,null,null,null,null,null,null,null,null,null,null,null,null,null,null,null,null,null,null,null,null,null,null,null,null,null,null,null,null,null,null,null,null,null,null,null,null,null,null,null,null,null,null,null,null,null,null,null,5,"JB 7-9"]
[]
[null,"Kvælstof (normtilførsel)",null,{"$f":"IF(Afgnr>1,VLOOKUP(Afgnr,_Afg07,Nnr),\"\")","v":""},{"$f":"IF(D185<>\"\",\"kg N\",\"\")","v":""},null,null,{"$f":"IF(Alt1nr>1,VLOOKUP(Alt1nr,_Afg07,Nnr),\"\")","v":""},{"$f":"IF(H185<>\"\",\"kg N\",\"\")","v":""},null,null,{"$f":"IF(Alt2nr>1,VLOOKUP(Alt2nr,_Afg07,Nnr),\"\")","v":""},{"$f":"IF(L185<>\"\",\"kg N\",\"\")","v":""},null,null,null,null,null,{"$f":"IF($C$43=\"\",\"\",\"Når man opretter 'egen afgrøde' angives niveauer for N,P,K ikke alene på baggrund af beregnede bortførte mængde, der indgår også indtastede tilførte mængder for 'egen afgrøde'.\")","v":""},null,null,null,null,null,null,null,null,null,null,null,null,null,null,null,null,null,null,null,null,null,null,null,null,null,null,null,null,null,null,null,null,null,null,null,null,null,null,null,null,null,null,null,null,null,null,null,null,null,null,null,null,null,null,null,null,null,null,null,null,null,null,null,null,null,null,null,null,null,null,null,null,null,null,null,null,null,null,null,null,"Halm anvendelse"]
[null,"Fosfor (bortførsel + startgødn.)",null,{"$f":"IF(Afgnr>1,(D563+D564+D565+D566)/Ppris,\"\")","v":""},{"$f":"IF(D186<>\"\",\"kg P\",\"\")","v":""},null,null,{"$f":"IF(Alt1nr>1,(H563+H564+H565+H566)/Ppris,\"\")","v":""},{"$f":"IF(H186<>\"\",\"kg P\",\"\")","v":""},null,null,{"$f":"IF(Alt2nr>1,(L563+L564+L565+L566)/Ppris,\"\")","v":""},{"$f":"IF(L186<>\"\",\"kg P\",\"\")","v":""},null,null,null,null,null,null,null,null,null,null,null,null,null,null,null,null,null,null,null,null,null,null,null,null,null,null,null,null,null,null,null,null,null,null,null,null,null,null,null,null,null,null,null,null,null,null,null,null,null,null,null,null,null,null,null,null,null,null,null,null,null,null,null,null,null,null,null,null,null,null,null,null,null,null,null,null,null,null,null,null,null,null,null,null,null,null,null,"Bjærges"]
[null,"Kalium (bortførsel)",null,{"$f":"IF(Afgnr>1,(D570+D571+D572)/Kpris,\"\")","v":""},{"$f":"IF(D187<>\"\",\"kg K\",\"\")","v":""},null,null,{"$f":"IF(Alt1nr>1,(H570+H571+H572)/Kpris,\"\")","v":""},{"$f":"IF(H187<>\"\",\"kg K\",\"\")","v":""},null,null,{"$f":"IF(Alt2nr>1,(L570+L571+L572)/Kpris,\"\")","v":""},{"$f":"IF(L187<>\"\",\"kg K\",\"\")","v":""},null,null,null,null,null,null,null,null,null,null,null,null,null,null,null,null,null,null,null,null,null,null,null,null,null,null,null,null,null,null,null,null,null,null,null,null,null,null,null,null,null,null,null,null,null,null,null,null,null,null,null,null,null,null,null,null,null,null,null,null,null,null,null,null,null,null,null,null,null,null,null,null,null,null,null,null,null,null,null,null,null,null,null,null,null,null,null,"Nedmuldes"]
[]
[null,null,null,null,null,null,null,null,null,null,null,null,null,null,null,null,null,null,null,null,null,null,null,null,null,null,null,null,null,null,null,null,null,null,null,null,null,null,null,null,null,null,null,null,null,null,null,null,null,null,null,null,null,null,null,null,null,null,null,null,null,null,null,null,null,null,null,null,null,null,null,null,null,null,null,null,null,null,null,null,null,null,null,null,null,null,null,null,null,null,null,null,null,null,null,null,null,null,null,"Kornsælger eller -køber"]
[null,null,null,null,null,null,{"$f":"IF(OR($CU$139=$R$340,$CV$139=$R$340,$CW$139=$R$340,$CX$139=$R$340),$S$340,\"\")","v":""},null,null,null,null,null,null,null,null,null,null,null,null,null,null,null,null,null,null,null,null,null,null,null,null,null,null,null,null,null,null,null,null,null,null,null,null,null,null,null,null,null,null,null,null,null,null,null,null,null,null,null,null,null,null,null,null,null,null,null,null,null,null,null,null,null,null,null,null,null,null,null,null,null,null,null,null,null,null,null,null,null,null,null,null,null,null,null,null,null,null,null,null,null,"Sælger",null,null,null,null,null,null,null,null,"Plove",null,null,null,null,null,"Stubharver",null,null,null,null,"Mejetærsker",null,null,"Såmaskiner",null,null,null,"Halmpresser",null,null,null,null,"Kartoffellægger",null,null,"ha/time"]
[null,null,null,null,null,null,{"$f":"IF($G$190=\"Sædskifte 1\",IF($CU$159>1,VLOOKUP($CU$159,_Afg07,2),\"\"),\"\")","v":""},null,{"$f":"IF($G$190=\"Sædskifte 1\",IF($CU$159>1,$D$68,\"\"),\"\")","v":""},{"$f":"IF(I191<>\"\",\"ha\",\"\")","v":""},{"$f":"IF($G$190=\"Sædskifte 1\",IF($CU$159>1,IF($F$68<>\"\",$F$68,$G$68),\"\"),\"\")","v":""},{"$f":"IF(K191<>\"\",H68,\"\")","v":""},{"$f":"IF($G$190=\"Sædskifte 1\",IF($CU$159>1,IF($I$68<>\"\",$I$68,$K$68),\"\"),\"\")","v":""},{"$f":"IF(M191<>\"\",\"kr.\",\"\")","v":""},null,null,null,null,null,null,null,null,null,null,null,null,null,null,null,null,null,null,null,null,null,null,null,null,null,null,null,null,null,null,null,null,null,null,null,null,null,null,null,null,null,null,null,null,null,null,null,null,null,null,null,null,null,null,null,null,null,null,null,null,null,null,null,null,null,null,null,null,null,null,null,null,null,null,null,null,null,null,null,null,null,null,null,null,null,null,"Køber",null,null,null,null,null,null,null,null,null,"Type","Kapacitet, ha/time","Lav-høj anvendelse, antal ha",null,null,null,"Type","Kapacitet, ha/time","Lav-høj anvendelse, antal ha",null,null,"Type",null,null,"Type","Kapacitet, ha/time",null,null,"Type","Kapacitet, ha/time","Transport, ha/time",null,1,"4 rækker u/ gødningsudstyr ",null,0.7]
[null,null,null,null,null,null,{"$f":"IF($G$190=\"Sædskifte 1\",IF($CU$161>1,VLOOKUP($CU$161,_Afg07,2),\"\"),\"\")","v":""},null,{"$f":"IF($G$190=\"Sædskifte 1\",IF($CU$161>1,$D$70,\"\"),\"\")","v":""},"",{"$f":"IF($G$190=\"Sædskifte 1\",IF($CU$161>1,IF($F$70<>\"\",$F$70,$G$70),\"\"),\"\")","v":""},{"$f":"IF(K192<>\"\",H70,\"\")","v":""},{"$f":"IF($G$190=\"Sædskifte 1\",IF($CU$161>1,IF($I$70<>\"\",$I$70,$K$70),\"\"),\"\")","v":""},"",null,null,null,null,null,null,null,null,null,null,null,null,null,null,null,null,null,null,null,null,null,null,null,null,null,null,null,null,null,null,null,null,null,null,null,null,null,null,null,null,null,null,null,null,null,null,null,null,null,null,null,null,null,null,null,null,null,null,null,null,null,null,null,null,null,null,null,null,null,null,null,null,null,null,null,null,null,null,null,null,null,null,null,null,null,null,null,null,null,null,null,null,null,null,null,1,"Vendeplov 4 fure ",0.9,"70-140 ha",null,null,1,"Stubharve 4 m (let) ",2.9,"200-400 ha",null,1,"Mejetærsker 5,4 m",1.7,1,"Kombiharve/såmaskine 3,0 m",2.4,null,1,"Minibigballer 1,5 kbm",4.9000000000000004,2,null,2,"4 rækker m/ gødningsudstyr ",null,0.7]
[null,null,null,null,null,null,{"$f":"IF($G$190=\"Sædskifte 1\",IF($CU$163>1,VLOOKUP($CU$163,_Afg07,2),\"\"),\"\")","v":""},null,{"$f":"IF($G$190=\"Sædskifte 1\",IF($CU$163>1,$D$72,\"\"),\"\")","v":""},"",{"$f":"IF($G$190=\"Sædskifte 1\",IF($CU$163>1,IF($F$72<>\"\",$F$72,$G$72),\"\"),\"\")","v":""},{"$f":"IF(K193<>\"\",H72,\"\")","v":""},{"$f":"IF($G$190=\"Sædskifte 1\",IF($CU$163>1,IF($I$72<>\"\",$I$72,$K$72),\"\"),\"\")","v":""},"",null,null,null,null,null,null,null,null,null,null,null,null,null,null,null,null,null,null,null,null,null,null,null,null,null,null,null,null,null,null,null,null,null,null,null,null,null,null,null,null,null,null,null,null,null,null,null,null,null,null,null,null,null,null,null,null,null,null,null,null,null,null,null,null,null,null,null,null,null,null,null,null,null,null,null,null,null,null,null,null,null,null,null,null,null,"Husdyrgødning",null,null,null,null,null,null,null,null,null,2,"Vendeplov 5 fure",1.1000000000000001,"85-170 ha",null,null,2,"Stubharve 4 m (tung)",2.7,"200-400 ha",null,2,"Mejetærsker 6,0 m",1.9,2,"Kombiharve/såmaskine  4,0 m",2.9,null,2,"Bigballer 3,5 kbm",5.3,3.2]
[null,null,null,null,null,null,{"$f":"IF($G$190=\"Sædskifte 1\",IF($CU$165>1,VLOOKUP($CU$165,_Afg07,2),\"\"),\"\")","v":""},null,{"$f":"IF($G$190=\"Sædskifte 1\",IF($CU$165>1,$D$74,\"\"),\"\")","v":""},"",{"$f":"IF($G$190=\"Sædskifte 1\",IF($CU$165>1,IF($F$74<>\"\",$F$74,$G$74),\"\"),\"\")","v":""},{"$f":"IF(K194<>\"\",H74,\"\")","v":""},{"$f":"IF($G$190=\"Sædskifte 1\",IF($CU$165>1,IF($I$74<>\"\",$I$74,$K$74),\"\"),\"\")","v":""},"",null,null,null,null,null,null,null,null,null,null,null,null,null,null,null,null,null,null,null,null,null,null,null,null,null,null,null,null,null,null,null,null,null,null,null,null,null,null,null,null,null,null,null,null,null,null,null,null,null,null,null,null,null,null,null,null,null,null,null,null,null,null,null,null,null,null,null,null,null,null,null,null,null,null,null,null,null,null,null,null,null,null,null,null,null,null,"Uden",null,null,null,null,null,null,null,null,3,"Vendeplov 8 fure",1.6,"120-240 ha",null,null,3,"Stubharve 6 m (tung)",4,"400-800 ha",null,3,"Mejetærsker 7,5 m",2.7,3,"Radsåmaskine 3,0 m",1.7,null,null,null,null,null,null,"Kartoffeloptager",null,null,"ha/time"]
[null,null,null,null,null,null,{"$f":"IF($G$190=\"Sædskifte 1\",IF($CU$167>1,VLOOKUP($CU$167,_Afg07,2),\"\"),\"\")","v":""},null,{"$f":"IF($G$190=\"Sædskifte 1\",IF($CU$167>1,$D$76,\"\"),\"\")","v":""},"",{"$f":"IF($G$190=\"Sædskifte 1\",IF($CU$167>1,IF($F$76<>\"\",$F$76,$G$76),\"\"),\"\")","v":""},{"$f":"IF(K195<>\"\",H76,\"\")","v":""},{"$f":"IF($G$190=\"Sædskifte 1\",IF($CU$167>1,IF($I$76<>\"\",$I$76,$K$76),\"\"),\"\")","v":""},"",null,null,null,null,null,null,null,null,null,null,null,null,null,null,null,null,null,null,null,null,null,null,null,null,null,null,null,null,null,null,null,null,null,null,null,null,null,null,null,null,null,null,null,null,null,null,null,null,null,null,null,null,null,null,null,null,null,null,null,null,null,null,null,null,null,null,null,null,null,null,null,null,null,null,null,null,null,null,null,null,null,null,null,null,null,null,"Med",null,null,null,null,null,null,null,null,4,"Vendeplov 12 fure",2.2999999999999998,"175-350 ha",null,null,4,"Tallerken / disc 4 m",2.8,"280-560 ha",null,4,"Mejetærsker 9,0 m",3.3,4,"Radsåmaskine 4,0 m",2.1,null,"Gyllevogn",null,null,"ton/time",null,1,"2 rk frilægger",null,0.8]
[null,null,null,null,null,null,{"$f":"IF($G$190=\"Sædskifte 1\",IF($CU$169>1,VLOOKUP($CU$169,_Afg07,2),\"\"),\"\")","v":""},null,{"$f":"IF($G$190=\"Sædskifte 1\",IF($CU$169>1,$D$78,\"\"),\"\")","v":""},"",{"$f":"IF($G$190=\"Sædskifte 1\",IF($CU$169>1,IF($F$78<>\"\",$F$78,$G$78),\"\"),\"\")","v":""},{"$f":"IF(K196<>\"\",H78,\"\")","v":""},{"$f":"IF($G$190=\"Sædskifte 1\",IF($CU$169>1,IF($I$78<>\"\",$I$78,$K$78),\"\"),\"\")","v":""},"",null,null,null,null,null,null,null,null,null,null,null,null,null,null,null,null,null,null,null,null,null,null,null,null,null,null,null,null,null,null,null,null,null,null,null,null,null,null,null,null,null,null,null,null,null,null,null,null,null,null,null,null,null,null,null,null,null,null,null,null,null,null,null,null,null,null,null,null,null,null,null,null,null,null,null,null,null,null,null,null,null,null,null,null,null,null,null,null,null,null,null,null,null,null,null,null,null,null,null,null,null,5,"Tallerken / disc 6 m",4.0999999999999996,"410-820 ha",null,5,"Mejetærsker 10,5 m",4,5,"Rotorharve/såmaskine 4,0 m",1.5,null,1,"Slæbeslanger 16 m / 15 ton ",null,51,null,2,"1 rk m/ tank/stensep.",null,0.3]
[null,null,null,null,null,null,{"$f":"IF($G$190=\"Sædskifte 1\",IF($CU$171>1,VLOOKUP($CU$171,_Afg07,2),\"\"),\"\")","v":""},null,{"$f":"IF($G$190=\"Sædskifte 1\",IF($CU$171>1,$D$80,\"\"),\"\")","v":""},"",{"$f":"IF($G$190=\"Sædskifte 1\",IF($CU$171>1,IF($F$80<>\"\",$F$80,$G$80),\"\"),\"\")","v":""},{"$f":"IF(K197<>\"\",H80,\"\")","v":""},{"$f":"IF($G$190=\"Sædskifte 1\",IF($CU$171>1,IF($I$80<>\"\",$I$80,$K$80),\"\"),\"\")","v":""},"",null,null,null,null,null,null,null,null,null,null,null,null,null,null,null,null,null,null,null,null,null,null,null,null,null,null,null,null,null,null,null,null,null,null,null,null,null,null,null,null,null,null,null,null,null,null,null,null,null,null,null,null,null,null,null,null,null,null,null,null,null,null,null,null,null,null,null,null,null,null,null,null,null,null,null,null,null,null,null,null,null,null,null,null,null,"Forfrugtsværdi",null,null,null,null,null,null,null,null,null,"Såbedsharver",null,null,null,null,null,"Marksprøjte",null,null,null,null,null,null,null,6,"Rotorharve/såmaskine 6,0 m",2.6,null,2,"Slæbeslanger 24 m / 20 ton ",null,60,null,3,"Selvkørende 2 rk m/ tank",null,0.9]
[null,null,null,null,null,null,null,null,null,null,null,null,null,null,null,null,null,null,null,null,null,null,null,null,null,null,null,null,null,null,null,null,null,null,null,null,null,null,null,null,null,null,null,null,null,null,null,null,null,null,null,null,null,null,null,null,null,null,null,null,null,null,null,null,null,null,null,null,null,null,null,null,null,null,null,null,null,null,null,null,null,null,null,null,null,null,null,null,null,null,null,null,null,null,null,null,null,null,null,null,"Ja",null,null,null,null,null,null,null,null,null,"Type","Kapacitet, ha/time",null,null,null,null,"Type","Kapacitet, ha/time",null,null,null,null,null,7,"Skiveskærmaskine 4 m",2.8,null,3,"Slæbeslanger 24 m / 25 ton ",null,66]
[null,null,null,null,null,null,{"$f":"IF(OR(CU139=R341,CV139=R341,CW139=R341,CX139=R341),S341,\"\")","v":""},null,null,null,null,null,null,null,null,null,null,null,null,null,null,null,null,null,null,null,null,null,null,null,null,null,null,null,null,null,null,null,null,null,null,null,null,null,null,null,null,null,null,null,null,null,null,null,null,null,null,null,null,null,null,null,null,null,null,null,null,null,null,null,null,null,null,null,null,null,null,null,null,null,null,null,null,null,null,null,null,null,null,null,null,null,null,null,null,null,null,null,null,null,"Nej",null,null,null,null,null,null,null,null,1,"Såbedsharve 4,5 m",3.3,null,null,null,1,"Sprøjte 24 m, 2800 liter ",5.3,null,null,null,null,null,8,"Skiveskærmaskine 6 m",3.8,null,4,"Nedfælder 6,0 m / 25 ton ",null,54]
[null,null,null,null,null,null,{"$f":"IF($G$199=\"Sædskifte 2\",IF(CU160>1,VLOOKUP(CU160,_Afg07,2),\"\"),\"\")","v":""},null,{"$f":"IF($G$199=\"Sædskifte 2\",IF(CU160>1,D89,\"\"),\"\")","v":""},{"$f":"IF(I200<>\"\",\"ha\",\"\")","v":""},{"$f":"IF($G$199=\"Sædskifte 2\",IF($CU160>1,IF(F89<>\"\",F89,G89),\"\"),\"\")","v":""},{"$f":"IF(K200<>\"\",H89,\"\")","v":""},{"$f":"IF($G$199=\"Sædskifte 2\",IF($CU160>1,IF(I89<>\"\",I89,K89),\"\"),\"\")","v":""},{"$f":"IF(M200<>\"\",\"kr.\",\"\")","v":""},null,null,null,null,null,null,null,null,null,null,null,null,null,null,null,null,null,null,null,null,null,null,null,null,null,null,null,null,null,null,null,null,null,null,null,null,null,null,null,null,null,null,null,null,null,null,null,null,null,null,null,null,null,null,null,null,null,null,null,null,null,null,null,null,null,null,null,null,null,null,null,null,null,null,null,null,null,null,null,null,null,null,null,null,null,null,null,null,null,null,null,null,null,null,null,2,"Såbedsharve 6,4 m ",4.7,null,null,null,2,"Sprøjte 24 m, 4000 liter",7,null,null,null,null,null,9,"Tandskærsmaskine 4 m ",2.1,null,5,"Nedfælder 7,5 m / 25 ton",null,60]
[null,null,null,null,null,null,{"$f":"IF($G$199=\"Sædskifte 2\",IF(CU162>1,VLOOKUP(CU162,_Afg07,2),\"\"),\"\")","v":""},null,{"$f":"IF($G$199=\"Sædskifte 2\",IF(CU162>1,D91,\"\"),\"\")","v":""},"",{"$f":"IF($G$199=\"Sædskifte 2\",IF($CU162>1,IF(F91<>\"\",F91,G91),\"\"),\"\")","v":""},{"$f":"IF(K201<>\"\",H91,\"\")","v":""},{"$f":"IF($G$199=\"Sædskifte 2\",IF($CU162>1,IF(I91<>\"\",I91,K91),\"\"),\"\")","v":""},{"$f":"IF(M201<>\"\",\"kr.\",\"\")","v":""},null,null,null,null,null,null,null,null,null,null,null,null,null,null,null,null,null,null,null,null,null,null,null,null,null,null,null,null,null,null,null,null,null,null,null,null,null,null,null,null,null,null,null,null,null,null,null,null,null,null,null,null,null,null,null,null,null,null,null,null,null,null,null,null,null,null,null,null,null,null,null,null,null,null,null,null,null,null,null,null,null,null,null,null,null,null,null,null,null,null,null,null,null,null,null,3,"Såbedsharve 9,1 m",6.6,null,null,null,3,"Sprøjte 36 m, 4000 liter",9,null,null,null,null,null,10,"Tandskærsmaskine 6 m ",2.8,null,6,"Selvkør. nedfælder 9 m/16 ton ",null,51,null,"Roeoptager",null,null,"ha/time"]
[null,null,null,null,null,null,{"$f":"IF($G$199=\"Sædskifte 2\",IF(CU164>1,VLOOKUP(CU164,_Afg07,2),\"\"),\"\")","v":""},null,{"$f":"IF($G$199=\"Sædskifte 2\",IF(CU164>1,D93,\"\"),\"\")","v":""},"",{"$f":"IF($G$199=\"Sædskifte 2\",IF($CU164>1,IF(F93<>\"\",F93,G93),\"\"),\"\")","v":""},{"$f":"IF(K202<>\"\",H93,\"\")","v":""},{"$f":"IF($G$199=\"Sædskifte 2\",IF($CU164>1,IF(I93<>\"\",I93,K93),\"\"),\"\")","v":""},"",null,null,null,null,null,null,null,null,null,null,null,null,null,null,null,null,null,null,null,null,null,null,null,null,null,null,null,null,null,null,null,null,null,null,null,null,null,null,null,null,null,null,null,null,null,null,null,null,null,null,null,null,null,null,null,null,null,null,null,null,null,null,null,null,null,null,null,null,null,null,null,null,null,null,null,null,null,null,null,null,null,null,null,null,null,null,null,null,null,null,null,null,null,null,null,4,"Tallerken / disc 4 m",2.8,null,null,null,4,"Sprøjte m/luft 24 m, 4400 liter",8,null,null,null,null,null,null,null,null,null,null,null,null,null,null,1,"Selvkørende 6 rk > 40 kbm tank ",null,1.3]
[null,null,null,null,null,null,{"$f":"IF($G$199=\"Sædskifte 2\",IF(CU166>1,VLOOKUP(CU166,_Afg07,2),\"\"),\"\")","v":""},null,{"$f":"IF($G$199=\"Sædskifte 2\",IF(CU166>1,D95,\"\"),\"\")","v":""},"",{"$f":"IF($G$199=\"Sædskifte 2\",IF($CU166>1,IF(F95<>\"\",F95,G95),\"\"),\"\")","v":""},{"$f":"IF(K203<>\"\",H95,\"\")","v":""},{"$f":"IF($G$199=\"Sædskifte 2\",IF($CU166>1,IF(I95<>\"\",I95,K95),\"\"),\"\")","v":""},"",null,null,null,null,null,null,null,null,null,null,null,null,null,null,null,null,null,null,null,null,null,null,null,null,null,null,null,null,null,null,null,null,null,null,null,null,null,null,null,null,null,null,null,null,null,null,null,null,null,null,null,null,null,null,null,null,null,null,null,null,null,null,null,null,null,null,null,null,null,null,null,null,null,null,null,null,null,null,null,null,null,null,null,null,null,null,null,null,null,null,null,null,null,null,null,5,"Tallerken / disc 6 m",4.0999999999999996,null,null,null,null,null,null,null,null,null,null,null,"Enkorn",null,"ha/time",null,"Gødningsspreder",null,null,"ha/time",null,2,"3 rk 12 kbm tank",null,0.7]
[null,null,null,null,null,null,{"$f":"IF($G$199=\"Sædskifte 2\",IF(CU168>1,VLOOKUP(CU168,_Afg07,2),\"\"),\"\")","v":""},null,{"$f":"IF($G$199=\"Sædskifte 2\",IF(CU168>1,D97,\"\"),\"\")","v":""},"",{"$f":"IF($G$199=\"Sædskifte 2\",IF($CU168>1,IF(F97<>\"\",F97,G97),\"\"),\"\")","v":""},{"$f":"IF(K204<>\"\",H97,\"\")","v":""},{"$f":"IF($G$199=\"Sædskifte 2\",IF($CU168>1,IF(I97<>\"\",I97,K97),\"\"),\"\")","v":""},"",null,null,null,null,null,null,null,null,null,null,null,null,null,null,null,null,null,null,null,null,null,null,null,null,null,null,null,null,null,null,null,null,null,null,null,null,null,null,null,null,null,null,null,null,null,null,null,null,null,null,null,null,null,null,null,null,null,null,null,null,null,null,null,null,null,null,null,null,null,null,null,null,null,null,null,null,null,null,null,null,null,null,null,null,null,null,null,null,null,null,null,null,null,null,null,null,null,null,null,null,null,null,null,null,null,null,null,null,null,1,"12 rækker",2.6,null,1,"Liftophængt 24 m / 3 ton ",null,6]
[null,null,null,null,null,null,{"$f":"IF($G$199=\"Sædskifte 2\",IF(CU170>1,VLOOKUP(CU170,_Afg07,2),\"\"),\"\")","v":""},null,{"$f":"IF($G$199=\"Sædskifte 2\",IF(CU170>1,D99,\"\"),\"\")","v":""},"",{"$f":"IF($G$199=\"Sædskifte 2\",IF($CU170>1,IF(F99<>\"\",F99,G99),\"\"),\"\")","v":""},{"$f":"IF(K205<>\"\",H99,\"\")","v":""},{"$f":"IF($G$199=\"Sædskifte 2\",IF($CU170>1,IF(I99<>\"\",I99,K99),\"\"),\"\")","v":""},"",null,null,null,null,null,null,null,null,null,null,null,null,null,null,null,null,null,null,null,null,null,null,null,null,null,null,null,null,null,null,null,null,null,null,null,null,null,null,null,null,null,null,null,null,null,null,null,null,null,null,null,null,null,null,null,null,null,null,null,null,null,null,null,null,null,null,null,null,null,null,null,null,null,null,null,null,null,null,null,null,null,null,null,null,null,null,null,null,null,null,null,null,null,null,null,null,null,null,null,null,null,null,null,null,null,null,null,null,null,null,null,null,null,2,"Bugseret 20 m / 10 ton ",null,9]
[null,null,null,null,null,null,{"$f":"IF($G$199=\"Sædskifte 2\",IF(CU172>1,VLOOKUP(CU172,_Afg07,2),\"\"),\"\")","v":""},null,{"$f":"IF($G$199=\"Sædskifte 2\",IF(CU172>1,D101,\"\"),\"\")","v":""},"",{"$f":"IF($G$199=\"Sædskifte 2\",IF($CU172>1,IF(F101<>\"\",F101,G101),\"\"),\"\")","v":""},{"$f":"IF(K206<>\"\",H101,\"\")","v":""},{"$f":"IF($G$199=\"Sædskifte 2\",IF($CU172>1,IF(I101<>\"\",I101,K101),\"\"),\"\")","v":""},"",null,null,null,null,null,null,null,null,null,null,null,null,null,null,null,null,null,null,null,null,null,null,null,null,null,null,null,null,null,null,null,null,null,null,null,null,null,null,null,null,null,null,null,null,null,null,null,null,null,null,null,null,null,null,null,null,null,null,null,null,null,null,null,null,null,null,null,null,null,null,null,null,null,null,null,null,null,null,null,null,null,null,null,null,null,null,null,null,null,null,null,null,null,null,null,null,null,null,null,null,null,null,null,null,null,null,null,null,null,null,null,null,null,3,"Bugseret 16 m / 5 ton",null,7.8]
[null,null,null,null,null,null,"Egen afgrøde:",null,{"$f":"C43","v":0}]
[]
[null,{"$f":"\"Jordtypen er \"&IF(JBnr=1,\"JB 1+3\",IF(JBnr=2,\"JB 2+4\",IF(JBnr=3,\"JB 1-4, vandet\",IF(JBnr=4,\"JB 5-6\",\"JB 7-9\"))))","v":"Jordtypen er JB 5-6"},null,{"$f":"IF(Hdgnr=1,\"Ingen husdyrgødning\",\"Husdyrgødning fra \"&VLOOKUP(Hdgnr,_Hdg2,2))","v":"Ingen husdyrgødning"}]
[null,{"$f":"IF(HalmJa=1,\"Halmen bjærges\",\"Halmen nedmuldes\")","v":"Halmen bjærges"},null,{"$f":"IF(Købernr=1,\"Bedriften er netto kornsælger\",\"Bedriften er netto kornkøber\")","v":"Bedriften er netto kornsælger"}]
[]
[]
[null,"Udskrift (side 2):"]
[]
[null,"Samlet økonomisk resultat for markbruget 2021"]
[]
[null,null,null,null,null,{"$f":"IF(OR($CU$139=$R$340,$CV$139=$R$340,$CW$139=$R$340),$S$340,\"\")","v":""},null,null,{"$f":"IF(OR(CU139=R341,CV139=R341,CW139=R341),S341,\"\")","v":""},null,null,{"$f":"IF(AND($F$217<>\"\",$I$217<>\"\"),\" Forskel\",\"\")","v":""}]
[null,"Antal ha",null,{"$f":"IF(F217=\"\",\"\",D82)","v":""},{"$f":"IF(D218=\"\",\"\",\"ha\")","v":""},null,null,{"$f":"IF(I217=\"\",\"\",D103)","v":""},{"$f":"IF(H218=\"\",\"\",\"ha\")","v":""},null,null,{"$f":"IF(AND($F$217<>\"\",$I$217<>\"\"),H218-D218,\"\")","v":""},{"$f":"IF(L218=\"\",\"\",\"ha\")","v":""}]
[]
[null,"Udbytte, kerne/frø",{"$f":"IF($F$217=\"\",\"\",IF(CU$139=R$340,D155,IF(CV$139=R$340,H155,IF(CW$139=R$340,L155,\"\")))*D$82)","v":""},null,{"$f":"IF(C220=\"\",\"\",\"kr.\")","v":""},null,{"$f":"IF($I$217=\"\",\"\",IF(CU$139=R$341,D155,IF(CV$139=R$341,H155,IF(CW$139=R$341,L155,\"\")))*D$103)","v":""},null,{"$f":"IF(G220=\"\",\"\",\"kr.\")","v":""},null,{"$f":"IF(AND($F$217<>\"\",$I$217<>\"\"),G220-C220,\"\")","v":""},null,{"$f":"IF(K220=\"\",\"\",\"kr.\")","v":""}]
[null,"Udbytte, halm",{"$f":"IF($F$217=\"\",\"\",IF(HalmJa=2,\"\",IF(CU$139=R$340,D156,IF(CV$139=R$340,H156,IF(CW$139=R$340,L156,\"\")))*D$82))","v":""},null,{"$f":"IF(C221=\"\",\"\",\"kr.\")","v":""},null,{"$f":"IF($I$217=\"\",\"\",IF(HalmJa=2,\"\",IF(CU$139=R$341,D156,IF(CV$139=R$341,H156,IF(CW$139=R$341,L156,\"\")))*D$103))","v":""},null,{"$f":"IF(G221=\"\",\"\",\"kr.\")","v":""},null,{"$f":"IF(AND($F$217<>\"\",$I$217<>\"\",HalmJa=1),G221-C221,\"\")","v":""},null,{"$f":"IF(K221=\"\",\"\",\"kr.\")","v":""}]
[null,"Udbytte i alt",{"$f":"IF($F$217=\"\",\"\",IF(CU$139=R$340,D159,IF(CV$139=R$340,H159,IF(CW$139=R$340,L159,\"\")))*D$82)","v":""},null,{"$f":"IF(C222=\"\",\"\",\"kr.\")","v":""},null,{"$f":"IF($I$217=\"\",\"\",IF(CU$139=R$341,D159,IF(CV$139=R$341,H159,IF(CW$139=R$341,L159,\"\")))*D$103)","v":""},null,{"$f":"IF(G222=\"\",\"\",\"kr.\")","v":""},null,{"$f":"IF(AND($F$217<>\"\",$I$217<>\"\"),G222-C222,\"\")","v":""},null,{"$f":"IF(K222=\"\",\"\",\"kr.\")","v":""}]
[]
[null,"Udsæd",{"$f":"IF($F$217=\"\",\"\",IF(CU$139=R$340,D161,IF(CV$139=R$340,H161,IF(CW$139=R$340,L161,\"\")))*D$82)","v":""},null,{"$f":"IF(C224=\"\",\"\",\"kr.\")","v":""},null,{"$f":"IF($I$217=\"\",\"\",IF(CU$139=R$341,D161,IF(CV$139=R$341,H161,IF(CW$139=R$341,L161,\"\")))*D$103)","v":""},null,{"$f":"IF(G224=\"\",\"\",\"kr.\")","v":""},null,{"$f":"IF(AND($F$217<>\"\",$I$217<>\"\"),G224-C224,\"\")","v":""},null,{"$f":"IF(K224=\"\",\"\",\"kr.\")","v":""}]
[null,"Gødning",{"$f":"IF($F$217=\"\",\"\",IF(CU$139=R$340,D162,IF(CV$139=R$340,H162,IF(CW$139=R$340,L162,\"\")))*D$82)","v":""},null,{"$f":"IF(C225=\"\",\"\",\"kr.\")","v":""},null,{"$f":"IF($I$217=\"\",\"\",IF(CU$139=R$341,D162,IF(CV$139=R$341,H162,IF(CW$139=R$341,L162,\"\")))*D$103)","v":""},null,{"$f":"IF(G225=\"\",\"\",\"kr.\")","v":""},null,{"$f":"IF(AND($F$217<>\"\",$I$217<>\"\"),G225-C225,\"\")","v":""},null,{"$f":"IF(K225=\"\",\"\",\"kr.\")","v":""}]
[null,"Planteværn",{"$f":"IF($F$217=\"\",\"\",IF(CU$139=R$340,D163,IF(CV$139=R$340,H163,IF(CW$139=R$340,L163,\"\")))*D$82)","v":""},null,{"$f":"IF(C226=\"\",\"\",\"kr.\")","v":""},null,{"$f":"IF($I$217=\"\",\"\",IF(CU$139=R$341,D163,IF(CV$139=R$341,H163,IF(CW$139=R$341,L163,\"\")))*D$103)","v":""},null,{"$f":"IF(G226=\"\",\"\",\"kr.\")","v":""},null,{"$f":"IF(AND($F$217<>\"\",$I$217<>\"\"),G226-C226,\"\")","v":""},null,{"$f":"IF(K226=\"\",\"\",\"kr.\")","v":""}]
[null,"Diverse",{"$f":"IF($F$217=\"\",\"\",IF(CU$139=R$340,D164,IF(CV$139=R$340,H164,IF(CW$139=R$340,L164,\"\")))*D$82)","v":""},null,{"$f":"IF(C227=\"\",\"\",\"kr.\")","v":""},null,{"$f":"IF($I$217=\"\",\"\",IF(CU$139=R$341,D164,IF(CV$139=R$341,H164,IF(CW$139=R$341,L164,\"\")))*D$103)","v":""},null,{"$f":"IF(G227=\"\",\"\",\"kr.\")","v":""},null,{"$f":"IF(AND($F$217<>\"\",$I$217<>\"\"),G227-C227,\"\")","v":""},null,{"$f":"IF(K227=\"\",\"\",\"kr.\")","v":""}]
[null,"Stykomkostninger i alt",{"$f":"IF($F$217=\"\",\"\",IF(CU$139=R$340,D165,IF(CV$139=R$340,H165,IF(CW$139=R$340,L165,\"\")))*D$82)","v":""},null,{"$f":"IF(C228=\"\",\"\",\"kr.\")","v":""},null,{"$f":"IF($I$217=\"\",\"\",IF(CU$139=R$341,D165,IF(CV$139=R$341,H165,IF(CW$139=R$341,L165,\"\")))*D$103)","v":""},null,{"$f":"IF(G228=\"\",\"\",\"kr.\")","v":""},null,{"$f":"IF(AND($F$217<>\"\",$I$217<>\"\"),G228-C228,\"\")","v":""},null,{"$f":"IF(K228=\"\",\"\",\"kr.\")","v":""}]
[]
[null,"Dækningsbidrag",{"$f":"IF($F$217=\"\",\"\",IF(CU$139=R$340,D167,IF(CV$139=R$340,H167,IF(CW$139=R$340,L167,\"\")))*D$82)","v":""},null,{"$f":"IF(C230=\"\",\"\",\"kr.\")","v":""},null,{"$f":"IF($I$217=\"\",\"\",IF(CU$139=R$341,D167,IF(CV$139=R$341,H167,IF(CW$139=R$341,L167,\"\")))*D$103)","v":""},null,{"$f":"IF(G230=\"\",\"\",\"kr.\")","v":""},null,{"$f":"IF(AND($F$217<>\"\",$I$217<>\"\"),G230-C230,\"\")","v":""},null,{"$f":"IF(K230=\"\",\"\",\"kr.\")","v":""}]
[]
[null,"Maskiner og arbejde",{"$f":"IF($F$217=\"\",\"\",IF(CU$139=R$340,D169,IF(CV$139=R$340,H169,IF(CW$139=R$340,L169,\"\")))*D$82)","v":""},null,{"$f":"IF(C232=\"\",\"\",\"kr.\")","v":""},null,{"$f":"IF($I$217=\"\",\"\",IF(CU$139=R$341,D169,IF(CV$139=R$341,H169,IF(CW$139=R$341,L169,\"\")))*D$103)","v":""},null,{"$f":"IF(G232=\"\",\"\",\"kr.\")","v":""},null,{"$f":"IF(AND($F$217<>\"\",$I$217<>\"\"),G232-C232,\"\")","v":""},null,{"$f":"IF(K232=\"\",\"\",\"kr.\")","v":""}]
[null,{"$f":"IF(Tørringnr=1,\"Tørring (løntørring)\",\"Tørring (korn i eget tørreri)\")","v":"Tørring (korn i eget tørreri)"},{"$f":"IF($F$217=\"\",\"\",IF(CU$139=R$340,D170,IF(CV$139=R$340,H170,IF(CW$139=R$340,L170,\"\")))*D$82)","v":""},null,{"$f":"IF(C233=\"\",\"\",\"kr.\")","v":""},null,{"$f":"IF($I$217=\"\",\"\",IF(CU$139=R$341,D170,IF(CV$139=R$341,H170,IF(CW$139=R$341,L170,\"\")))*D$103)","v":""},null,{"$f":"IF(G233=\"\",\"\",\"kr.\")","v":""},null,{"$f":"IF(AND($F$217<>\"\",$I$217<>\"\"),G233-C233,\"\")","v":""},null,{"$f":"IF(K233=\"\",\"\",\"kr.\")","v":""}]
[null,{"$f":"IF(Købernr=2,\"Erstatningskorn\",\"\")","v":""},{"$f":"IF(Købernr=1,\"\",IF($F$217=\"\",\"\",IF(CU$139=R$340,D171,IF(CV$139=R$340,H171,IF(CW$139=R$340,L171,\"\")))*D$82))","v":""},null,{"$f":"IF(C234=\"\",\"\",\"kr.\")","v":""},null,{"$f":"IF(Købernr=1,\"\",IF($I$217=\"\",\"\",IF(CU$139=R$341,D171,IF(CV$139=R$341,H171,IF(CW$139=R$341,L171,\"\")))*D$103))","v":""},null,{"$f":"IF(G234=\"\",\"\",\"kr.\")","v":""},null,{"$f":"IF(Købernr=1,\"\",IF(AND($F$217<>\"\",$I$217<>\"\"),G234-C234,\"\"))","v":""},null,{"$f":"IF(K234=\"\",\"\",\"kr.\")","v":""}]
[]
[null,"Resultat",{"$f":"IF($F$217=\"\",\"\",IF(CU$139=R$340,D173,IF(CV$139=R$340,H173,IF(CW$139=R$340,L173,\"\")))*D$82)","v":""},null,{"$f":"IF(C236=\"\",\"\",\"kr.\")","v":""},null,{"$f":"IF($I$217=\"\",\"\",IF(CU$139=R$341,D173,IF(CV$139=R$341,H173,IF(CW$139=R$341,L173,\"\")))*D$103)","v":""},null,{"$f":"IF(G236=\"\",\"\",\"kr.\")","v":""},null,{"$f":"IF(AND($F$217<>\"\",$I$217<>\"\"),G236-C236,\"\")","v":""},null,{"$f":"IF(K236=\"\",\"\",\"kr.\")","v":""}]
[]
[null,null,null,null,null,null,null,null,null,null,null,null,null,null,null,null,null,null,{"$f":"IF($C$43=\"\",\"\",\"Når man opretter `Egen afgrøde` beregnes mængderne af foderkorn ikke korrekt\")","v":""}]
[null,{"$f":"IF(FEnr=1,\"Foderbehov (korn)\",\"\")","v":""},{"$f":"IF(OR($F$217=\"\",FEnr=2),\"\",C391)","v":""},null,{"$f":"IF(C239<>\"\",\"FEsv\",\"\")","v":""},null,{"$f":"IF(OR($I$217=\"\",FEnr=2),\"\",C391)","v":""},null,{"$f":"IF(G239<>\"\",\"FEsv\",\"\")","v":""}]
[null,{"$f":"IF(FEnr=1,\"Foder produceret\",\"\")","v":""},{"$f":"IF(OR($F$217=\"\",FEnr=2),\"\",IF(CU$139=R$340,D180,IF(CV$139=R$340,H180,IF(CW$139=R$340,L180,\"\")))*D$82)","v":""},null,{"$f":"IF(C240<>\"\",\"FEsv\",\"\")","v":""},null,{"$f":"IF(OR($I$217=\"\",FEnr=2),\"\",IF(CU$139=R$341,D180,IF(CV$139=R$341,H180,IF(CW$139=R$341,L180,\"\")))*D$103)","v":""},null,{"$f":"IF(G240<>\"\",\"FEsv\",\"\")","v":""},null,{"$f":"IF(AND($F$217<>\"\",$I$217<>\"\",FEnr=1),G240-C240,\"\")","v":""},null,{"$f":"IF(K240<>\"\",\"FEsv\",\"\")","v":""}]
[]
[]
[null,{"$f":"G190","v":""},null,"Areal  ",null,null,"Udbytte  ",null,"Pris"]
[null,"I alt",{"$f":"D218","v":""},{"$f":"E218","v":""}]
[null,{"$f":"G191","v":""},{"$f":"I191","v":""},"",null,{"$f":"K191","v":""},"","",""]
[null,"","","",null,"","","",""]
[null,"","","",null,"","","",""]
[null,"","","",null,"","","",""]
[null,"","","",null,"","","",""]
[null,"","","",null,"","","",""]
[null,"","","",null,"","","",""]
[]
[null,{"$f":"G199","v":""},null,{"$f":"IF(I218=\"\",\"\",\"Areal  \")","v":""},null,null,{"$f":"IF(I217=\"\",\"\",\"Udbytte  \")","v":""},null,{"$f":"IF(I217=\"\",\"\",\"Pris\")","v":""}]
[null,{"$f":"IF(I217=\"\",\"\",\"I alt\")","v":""},{"$f":"H218","v":""},{"$f":"I218","v":""}]
[null,{"$f":"G200","v":""},{"$f":"I200","v":""},"",null,{"$f":"K200","v":""},"","",""]
[null,"","","",null,"","","",""]
[null,"","","",null,"","","",""]
[null,"","","",null,"","","",""]
[null,"","","",null,"","","",""]
[null,"",{"$f":"I205","v":""},"",null,{"$f":"K205","v":""},"","",""]
[null,"","","",null,"","","",""]
[]
[]
[null,{"$f":"\"Jordtypen er \"&IF(JBnr=1,\"JB 1+3\",IF(JBnr=2,\"JB 2+4\",IF(JBnr=3,\"JB 1-4, vandet\",IF(JBnr=4,\"JB 5-6\",\"JB 7-9\"))))","v":"Jordtypen er JB 5-6"},null,{"$f":"IF(Hdgnr=1,\"Ingen husdyrgødning\",\"Husdyrgødning fra \"&VLOOKUP(Hdgnr,_Hdg2,2))","v":"Ingen husdyrgødning"}]
[null,{"$f":"IF(HalmJa=1,\"Halmen bjærges\",\"Halmen nedmuldes\")","v":"Halmen bjærges"},null,{"$f":"IF(Købernr=1,\"Bedriften er netto kornsælger\",\"Bedriften er netto kornkøber\")","v":"Bedriften er netto kornsælger"}]
[]
[]
[]
[]
[]
[]
[]
[]
[]
[]
[]
[]
[]
[]
[]
[]
[]
[]
[null,null,null,null,null,null,null,null,null,null,null,null,null,null,null,null,null,null,"Normtabel"]
[null,"Normer",null,null,null,null,null,null,null,null,null,null,null,null,null,null,null,1,2,3,4,5,6,7,8,9,10,11,12,13,14,15,16,17,18,19,20,21,22,23,24,25,26,27,28,29,30,31,32,33,34,35,36,37,38,39,40,41,42,43,44,45,46,47,48,49,50,51,52,53,54,55,56,57,58,59,60,61,62,63,64,65,66,67,68,69,70,71,72]
[null,null,null,null,null,null,null,null,null,null,null,null,null,null,null,null,null,null,null,null,null,"Normudbytter",null,null,null,null,"Halmudbytte, kg pr. ha",null,null,null,null,"Forfrugtsværdi, merudbytte hkg pr. ha",null,null,null,null,"Sparet N","Udsæd","Planteværn","Analyser","Sum","N-gødning, kg N pr. ha",null,null,null,null,"P-start 1","P-start 2","P-kerne","P-halm","K-start","K-kerne","K-halm","Øvrig stykomk (udbytteafhængig)","Afgrøder","Maskin- og arbejdsomk. (med halmbj.), kr. pr. ha",null,null,null,null,"Maskin- og arbejdsomk. (uden halmbj.), kr. pr. ha",null,null,null,null,"Tørring","Eget tørreri","Gylle omk","Plansilo","Stålsilo","Gastæt silo",null,"Korn","Pløjning","Såbed","Glyphosat","Såning","Harvning","Høst","Halm","Mejetærskertid","Enkorn-","Kartoffel-","Kartoffel-","Roe-","Planteværn","Gødskning","Gylle","Korn-"]
[null,"Kvælstofpris",null,{"$f":"D18","v":5.5},null,null,null,null,null,null,null,null,null,null,null,null,null,null,"Afgrøde","Enhed","Pris","JB 1+3","JB 2+4","JB 1-4, vandet","JB 5-6","JB 7-9","JB 1+3","JB 2+4","JB 1-4, vandet","JB 5-6","JB 7-9","JB 1+3","JB 2+4","JB 1-4, vandet","JB 5-6","JB 7-9","Alle JB","Alle JB","Alle JB","Alle JB","Alle JB","JB 1+3","JB 2+4","JB 1-4, vandet","JB 5-6","JB 7-9","Alle JB","Alle JB","Alle JB","Alle JB","JB1+3 og vandet","Alle JB","Alle JB","Alle JB",null,"JB 1+3","JB 2+4","JB 1-4, vandet","JB 5-6","JB 7-9","JB 1+3","JB 2+4","JB 1-4, vandet","JB 5-6","JB 7-9","Kr./hkg",null,"kr. pr. ton","kr./hkg","kr./hkg","kr./hkg","FE","1 = ja",null,"Harvning",null,null,"efter høst","(korn og frø)",null,"faktor","såning","lægning","optagning","optagning","Antal beh.","Antal beh.","Ton pr. ha","type","Afgrøde"]
[null,null,null,null,null,null,null,null,null,null,null,null,null,null,null,null,null,1,null,null,null,null,null,null,null,null,null,null,null,null,null,null,null,null,null,null,null,null,null,null,null,null,null,null,null,null,null,null,null,null,null,null,null,null,null,null,null,null,null,null,null,null,null,null,null,null,null,null,null,null,null,null,1]
[null,null,null,null,null,null,null,null,null,null,null,null,null,null,null,null,null,2,"Egen afgrøde","hkg",{"$f":"C47","v":0},{"$f":"C46","v":0},{"$f":"C46","v":0},{"$f":"C46","v":0},{"$f":"C46","v":0},{"$f":"C46","v":0},{"$f":"C49","v":0},{"$f":"C49","v":0},{"$f":"C49","v":0},{"$f":"C49","v":0},{"$f":"C49","v":0},{"$f":"C55","v":0},{"$f":"C55","v":0},{"$f":"C55","v":0},{"$f":"C55","v":0},{"$f":"C55","v":0},{"$f":"C56","v":0},{"$f":"-I46","v":0},{"$f":"-I51","v":0},{"$f":"-I52","v":0},{"$f":"AL289+AM289+AN289","v":0},{"$f":"$I$48","v":0},{"$f":"$I$48","v":0},{"$f":"$I$48","v":0},{"$f":"$I$48","v":0},{"$f":"$I$48","v":0},null,null,{"$f":"$I$49/D141","v":{"$error":"#DIV/0!"}},null,null,{"$f":"I50/D152","v":{"$error":"#VALUE!"}},null,0,null,{"$f":"-$I$55","v":0},{"$f":"-$I$55","v":0},0,0,0,0,0,0,0,0,{"$f":"-$I$56","v":0},{"$f":"-$I$56","v":0},null,{"$f":"-$I$56","v":0},{"$f":"-$I$56","v":0},0]
[null,"Fosforpris",null,{"$f":"D20","v":9},null,null,null,null,null,null,null,null,null,null,null,null,null,3,"Alm. Rajgræs","hkg",850,11,15,15,16,16,3800,3800,5300,5300,5300,2,4,4,6,6,9,420,850,175,{"$f":"AL290+AM290+AN290","v":1445},158,158,158,158,158,null,5,0.39600000000000002,9.7500000000000003E-2,20,0.66,2.125,53.06666666666667,"Alm. Rajgræs",3866,3866,6557,4717,4717,3965,3965,5345,3505,3505,30,28,19,null,null,null,0,2,null,null,null,1,2,2,2,2.5,null,null,null,null,3,1,30,null,"Alm. Rajgræs"]
[null,null,null,null,null,null,null,null,null,null,null,null,null,null,null,null,null,4,"Alm. rajgræs, Øko","hkg",1400,7.5,9.5,9.5,11,11,2400,2400,4500,3000,3000,2,4,4,6,6,9,350,0,0,350,105,105,105,105,105,null,5,0.39600000000000002,9.7500000000000003E-2,20,0.66,2.125,55.555555555555557,"Alm. rajgræs, Øko",4300,4300,6850,4770,4770,3620,3620,5774,3949,3949,30,28,19,null,null,null,0,2,null,null,null,1,2,2,2,2.5,null,null,null,null,null,null,45,null,"Alm. rajgræs, Øko"]
[null,"Kaliumpris",null,{"$f":"D22","v":6},null,null,null,null,null,null,null,null,null,null,null,null,null,5,"Efterafgr. Olieræddike",null,0,0,0,0,0,0,null,null,null,null,null,null,null,null,null,null,25,260,0,0,260,0,0,0,0,0,null,null,null,null,null,null,null,null,"Efterafgr. Olieræddike",140,140,140,140,140,140,140,140,140,140,0,0,0,null,null,null,0,null,null,2,null,2,null,null,null,null,null,null,null,null,null,null,null,null,"Efterafgr. Olieræddike"]
[null,null,null,null,null,null,null,null,null,null,null,null,null,null,null,null,null,6,"Efterafgr. Rajgræs",null,0,0,0,0,0,0,null,null,null,null,null,null,null,null,null,null,25,280,0,0,280,0,0,0,0,0,null,null,null,null,null,null,null,null,"Efterafgr. Rajgræs",140,140,140,140,140,140,140,140,140,140,0,0,0,null,null,null,0,null,null,2,null,2,null,null,null,null,null,null,null,null,null,null,null,null,"Efterafgr. Rajgræs"]
[null,"Meromkostning til erstatningskorn",null,{"$f":"D24","v":15},null,null,null,null,null,null,null,null,null,null,null,null,null,7,"Efterafgr. Gul sennep",null,0,0,0,0,0,0,null,null,null,null,null,null,null,null,null,null,25,160,0,0,160,0,0,0,0,0,null,null,null,null,null,null,null,null,"Efterafgr. Gul sennep",140,140,140,140,140,140,140,140,140,140,0,0,0,null,null,null,0,null,null,2,null,2,null,null,null,null,null,null,null,null,null,null,null,null,"Efterafgr. Gul sennep"]
[null,null,null,null,null,null,null,null,null,null,null,null,null,null,null,null,null,8,"Engrapgræs (mark)","hkg",1800,11,11,11,11,11,0,0,0,0,0,2,4,4,6,6,9,800,570,175,1545,160,160,160,160,160,null,5,0.39600000000000002,9.7500000000000003E-2,20,0.66,2.125,73.909090909090907,"Engrapgræs (mark)",4106,4106,5631,4106,4106,4106,4106,5631,4106,4106,30,28,0,null,null,null,0,2,null,null,null,1,2,1,1,3,null,null,null,null,1,2,null,null,"Engrapgræs (mark)"]
[null,"Kornpris, forfrugtsværdi",null,{"$f":"D26","v":115},null,null,null,null,null,null,null,null,null,null,null,null,null,9,"Engrapgræs (plæne)","hkg",1500,8,8,8,8,8,0,0,0,0,0,2,4,4,6,6,9,800,570,175,1545,170,170,170,170,170,null,5,0.39600000000000002,9.7500000000000003E-2,20,0.66,2.125,101.625,"Engrapgræs (plæne)",4106,4106,5631,4106,4106,4106,4106,5631,4106,4106,30,28,0,null,null,null,0,2,null,null,null,1,2,1,1,3,null,null,null,null,1,2,null,null,"Engrapgræs (plæne)"]
[null,null,null,null,null,null,null,null,null,null,null,null,null,null,null,null,null,10,"Fabrikskartofler","hkg",63,480,530,595,595,595,0,0,0,0,0,2,4,4,6,6,0,3312,4686,0,7998,206,202,227,202,202,7.5,null,4.5999999999999999E-2,0,20,0.40200000000000002,0,5.9810964083175806,"Fabrikskartofler",10050,11173,14276,12075,12075,10050,11173,14276,12075,12075,0,0,0,null,null,null,0,2,1,1,1,null,3,null,null,null,null,1,1,null,14,1,null,null,"Fabrikskartofler"]
[null,"N i husdyrgødning fra 1 DE svin",null,100,null,"kg N (total)",null,null,null,null,null,null,null,null,null,null,null,11,"Grøngødning",null,0,0,0,0,0,0,0,0,0,0,0,2,4,4,6,6,58,486,0,0,486,0,0,0,0,0,null,0,0,0,0,0,0,53.06666666666667,"Grøngødning",580,580,580,580,580,580,580,580,580,580,0,0,0,null,null,null,0,2,1,null,null,null,null,null,null,null,null,null,null,null,null,null,null,null,"Grøngødning"]
[null,null,null,null,null,null,null,null,null,null,null,null,null,null,null,null,null,12,"Havre      ","hkg",100,46,62,59,60,65,2500,2500,3200,3300,3300,5,7,7,8,9,0,488,265,0,753,115,111,132,109,116,null,2.5,0.34849999999999998,0.11899999999999999,20,0.42499999999999999,1.2749999999999999,0,"Havre",3781,3781,5912,4192,4192,3150,3150,5135,3395,3395,9,5,20,8,7,6.5,87,1,1,1,1,1,2,2,2,1.2,null,null,null,null,2,1,32,"Havre","Havre"]
[null,"P i husdyrgødning fra 1 DE svin",null,25,null,"kg P",null,null,null,null,null,null,null,null,null,null,null,13,"Havre Øko","hkg",150,30,30,50,50,50,2000,2000,2400,2400,2400,5,7,7,8,9,0,680,0,0,{"$f":"AL300+AM300+AN300","v":680},100,100,100,100,100,null,null,0.34849999999999998,0.11899999999999999,20,0.42499999999999999,1.2749999999999999,0,"Havre Øko",4344,4344,6609,4966,4966,3798,3798,5968,4322,4322,9.3000000000000007,5,20,8,7,6.5,87,1,1,1,null,1,2,2,2,1.2,null,null,null,null,null,null,20,"Havre","Havre Øko"]
[null,null,null,null,null,null,null,null,null,null,null,null,null,null,null,null,null,14,"Hestebønne","hkg",140,46,46,46,46,46,0,0,0,0,0,5,7,7,8,9,9,1035,685,0,{"$f":"AL301+AM301+AN301","v":1720},0,0,0,0,0,null,2.5,0.4214,0.17,20,0.98040000000000005,0.63749999999999996,0,"Hestebønne",3739,3739,5567,3826,3826,3739,3739,5567,3826,3826,16,14,0,null,null,null,101,2,1,1,1,1,2,null,null,1,null,null,1,null,2,1,0,null,"Hestebønne"]
[null,"K i husdyrgødning fra 1 DE svin",null,50,null,"kg K",null,null,null,null,null,null,null,null,null,null,null,15,"Hestebønne Øko","hkg",300,20,20,37,37,37,0,0,0,0,0,2,4,4,6,6,9,1265,0,null,1265,0,0,0,0,0,null,null,0.53,0,20,1.03,0,null,"Hestebønne Øko",3750,3750,6022,4332,4332,3750,3750,6022,4332,4332,16,20.6,0,45,null,null,null,2,1,1,null,1,3,null,null,1,null,null,1,null,null,null,0,null,"Hestebønne Øko"]
[null,null,null,null,null,null,null,null,null,null,null,null,null,null,null,null,null,16,"Hvidkløver Øko","hkg",4800,2.5,2.5,2.5,2.5,2.5,0,0,0,0,0,10,10,10,10,10,86,570,0,150,720,0,0,0,0,0,null,null,0.38,0,20,1.06,0,74.666666666666671,"Hvidkløver Øko",2349,2349,3849,2349,2349,2349,2349,3849,2349,2349,30,28,0,null,null,null,null,2,null,null,null,null,1,1,null,3,null,null,null,null,null,null,0,null,"Hvidkløver Øko"]
[null,"N i husdyrgødning fra 1 DE kvæg",null,100,null,"kg N (total)",null,null,null,null,null,null,null,null,null,null,null,17,"Hybridrug","hkg",100,64,79,79,91,96,4200,4200,5400,6200,6200,null,null,null,null,null,null,638,710,0,1348,150,153,168,166,177,null,null,0.28899999999999998,7.6499999999999999E-2,20,0.46750000000000003,1.02,0,"Hybridrug",4813,4813,7355,5628,5628,3829,3829,6122,4229,4229,9,5,20,8,7,6.5,110,1,3,3,3,3,2,2,2,1.6,null,null,null,null,2,2,30,"Rug","Hybridrug"]
[null,null,null,null,null,null,null,null,null,null,null,null,null,null,null,null,null,18,"Kløvergræs, slæt","ae",132,79,83,96,84,84,0,0,0,0,0,2,4,4,6,6,86,324,0,0,324,284,287,300,290,290,null,null,0.442,0,20,3,0,null,"Kløvergræs, slæt",4724,4724,7215,4846,4846,4724,4724,7215,4846,4846,0,0,23,null,null,null,0,2,1,null,null,null,null,null,null,null,null,null,null,null,null,3,60,null,"Kløvergræs, slæt"]
[null,"P i husdyrgødning fra 1 DE kvæg",null,17,null,"kg P",null,null,null,null,null,null,null,null,null,null,null,19,"Lucerne (tørret)","hkg",50,110,120,140,130,130,0,0,0,0,0,2,4,4,6,6,86,600,0,0,600,0,0,0,0,0,null,null,0.26,0,20,2.6,0,null,"Lucerne (tørret)",372,372,372,372,372,372,372,372,372,372,0,0,0,null,null,null,0,2,null,null,null,null,null,null,null,null,null,null,null,null,1,2,0,null,"Lucerne (tørret)"]
[null,null,null,null,null,null,null,null,null,null,null,null,null,null,null,null,null,20,"Læggekartofler","hkg",185,270,295,325,325,325,0,0,0,0,0,2,4,4,6,6,0,8400,4995,0,13395,136,126,146,121,121,7.5,null,5.1999999999999998E-2,0,20,0.50600000000000001,0,29.630498533724339,"Læggekartofler",0,0,18457,16256,16256,0,0,18457,16256,16256,0,0,0,null,null,null,0,2,1,1,1,null,3,null,null,null,null,1,1,null,12,1,0,null,"Læggekartofler"]
[null,"K i husdyrgødning fra 1 DE kvæg",null,67,null,"kg K",null,null,null,null,null,null,null,null,null,null,null,21,"Majs, biogas","hkg ts",111,76,76,94,94,94,0,0,0,0,0,null,null,null,null,null,0,1560,500,0,2060,168,153,184,157,165,7.5,null,0.26,0,20,1.2,0,null,"Majs, biogas",4205,4205,6114,4396,4396,4205,4205,6114,4396,4396,0,0,20,null,null,null,0,2,1,1,1,null,3,3,null,2,1,null,null,null,2,1,41,null,"Majs, biogas"]
[null,null,null,null,null,null,null,null,null,null,null,null,null,null,null,null,null,22,"Majs, helsæd","ae",99,102,102,112,111,117,0,0,0,0,0,null,null,null,null,null,0,1560,500,370,2430,168,153,184,157,165,7.5,null,0.30420000000000003,0,20,1.4039999999999999,0,null,"Majs, helsæd",4205,4205,6114,4396,4396,4205,4205,6114,4396,4396,0,0,20,null,null,null,0,2,1,1,1,null,3,3,null,2,1,null,null,null,2,1,41,null,"Majs, helsæd"]
[null,"Udnyttelse af N i svinegødning",null,{"$f":"D28","v":80},null,"%",null,null,null,null,null,null,null,null,null,null,null,23,"Majs, kerne til svin","hkg",132,89.7,89.7,98.4,98,98,0,0,0,0,0,null,null,null,null,null,null,1560,500,97,2157,168,153,184,157,165,7.5,null,0.27200000000000002,0,20,0.35,0,0,"Majs, kerne",6068,6068,8807,6376,6376,6068,6068,8807,6376,6376,0,0,20,28,28,14,122,1,1,1,1,null,3,3,null,1,1,null,null,null,2,1,41,"Majs","Majs, kerne"]
[null,null,null,null,null,null,null,null,null,null,null,null,null,null,null,null,null,24,"Markært","hkg",140,46,46,46,46,46,0,0,0,0,0,5,7,7,8,9,14,800,535,0,1335,0,0,0,0,0,null,2.5,0.4214,0.17,20,0.98040000000000005,0.63749999999999996,0,"Markært",3702,3702,5552,3811,3811,3702,3702,5552,3811,3811,16,14,0,null,null,null,101,2,1,1,1,1,2,2,null,1,null,null,null,null,2,1,0,null,"Markært"]
[null,"Udnyttelse af N i kvæggødning",null,{"$f":"D30","v":75},null,"%",null,null,null,null,null,null,null,null,null,null,null,25,"Markært Øko","hkg",295,26,26,28,30,30,0,0,0,0,0,5,7,7,8,9,9,1193,null,null,1193,0,0,0,0,0,null,null,0.4214,0.17,20,0.98040000000000005,0.63749999999999996,0,"Markært Øko",4050,4050,5985,4340,4340,4050,4050,5985,4340,4340,16,14,0,null,null,null,101,2,1,1,null,1,2,2,null,1,null,null,null,null,null,null,0,null,"Markært Øko"]
[null,null,null,null,null,null,null,null,null,null,null,null,null,null,null,null,null,26,"Rødkløver Øko","hkg",4500,2,2,2,2,2,0,0,0,0,0,10,10,10,10,10,86,425,null,150,575,0,0,0,0,0,null,null,0.4214,0.17,20,1.06,0,80,"Rødkløver Øko",2349,2349,3849,2349,2349,2349,2349,3849,2349,2349,30,28,0,null,null,null,null,2,null,null,null,null,2,2,null,1,null,null,null,null,null,null,0,null,"Rødkløver Øko"]
[null,"Halmpris",null,{"$f":"D32","v":0.5},null,"kr. pr. kg",null,null,null,null,null,null,null,null,null,null,null,27,"Rødsvingel","hkg",950,14,14,14,14,14,0,0,5300,5300,5300,2,4,4,6,6,9,490,680,175,1345,150,150,150,150,150,null,5,0.29920000000000002,9.7500000000000003E-2,20,0.66,2.125,75,"Rødsvingel",5120,5120,6620,5120,5120,3908,3908,5408,3908,3908,30,28,0,null,null,null,0,2,null,null,null,1,2,2,2,2.5,null,null,null,null,3,2,0,null,"Rødsvingel"]
[null,null,null,null,null,null,null,null,null,null,null,null,null,null,null,null,null,28,"Smalbl. Lupin Øko","hkg",295,25,25,25,20,20,0,0,0,0,0,2,4,4,6,6,6,1260,null,null,1260,0,0,0,0,0,null,null,0.61,0,20,1.1499999999999999,0,0,"Smalbl. Lupin Øko",4089,4089,5988,4190,4190,4089,4089,5988,4190,4190,15,20.6,0,null,null,null,null,null,null,null,null,null,null,null,null,null,null,null,null,null,null,null,0,null,"Smalbl. Lupin Øko"]
[null,"Årstal på udskrift",null,{"$f":"D34","v":2021},null,null,null,null,null,null,null,null,null,null,null,null,null,29,"Spisekartofler Øko","hkg",220,150,150,200,200,200,0,0,0,0,0,2,4,4,6,6,6,4840,null,null,4840,105,105,105,105,105,null,null,0.06,0,20,0.40200000000000002,0,34.225000000000001,"Spisekartofler Øko",11251,11251,13695,11649,11649,11251,11251,13695,11649,11649,null,null,22,null,null,null,null,null,null,null,null,null,null,null,null,null,null,null,null,null,null,null,14,null,"Spisekartofler Øko"]
[null,null,null,null,null,null,null,null,null,null,null,null,null,null,null,null,null,30,"Spisekartofler","hkg",120,290,361,379,379,379,0,0,0,0,0,2,4,4,6,6,0,6560,3370,0,9930,170,170,190,165,165,7.5,null,0.06,0,20,0.40200000000000002,0,31.21,"Spisekartofler",13197,15546,18429,16263,16263,13197,15546,18429,16263,16263,0,0,0,null,null,null,0,2,1,1,1,null,3,null,null,null,null,1,1,null,10,1,0,null,"Spisekartofler"]
[null,null,null,null,null,null,null,null,null,null,null,null,null,null,null,null,null,31,"Sukkerroer","hkg",21,496,550,550,676,740,0,0,0,0,0,5,7,7,8,9,14,1800,1610,0,3410,134,124,139,127,133,7.5,null,0.04,0,20,0.22,0,2.5,"Sukkerroer",4185,4240,4240,5975,5975,4185,4240,4240,5975,5975,0,0,0,null,null,null,0,2,1,1,1,null,null,3,null,null,1,null,null,1,5,1,0,null,"Sukkerroer"]
[null,null,null,null,null,null,null,null,null,null,null,null,null,null,null,null,null,32,"Triticale  ","hkg",105,51,63,63,71,75,3400,3400,4300,5000,5000,null,null,null,null,null,null,588,925,0,1513,179,181,193,188,199,null,null,0.35699999999999998,8.5000000000000006E-2,20,0.54400000000000004,1.02,0,"Triticale",4671,4671,7119,5329,5329,3853,3853,6114,4179,4179,9,5,19,8,7,6.5,113,1,3,3,3,3,2,2,2,1.2,null,null,null,null,2,2,30,"Triticale","Triticale"]
[null,null,null,null,null,null,null,null,null,null,null,null,null,null,null,null,null,33,"Triticale Øko","hkg",160,35,35,50,50,50,2600,2600,4100,4100,4100,null,null,null,null,null,null,799,null,null,799,105,105,105,105,105,null,null,0.35699999999999998,8.5000000000000006E-2,20,0.54400000000000004,1.02,null,"Triticale Øko",4541,4541,7199,5278,5278,3859,3859,6228,4281,4281,9.3000000000000007,5,19,8,7,6.5,113,1,3,3,null,3,2,2,2,1.2,null,null,null,null,null,null,20,"Triticale","Triticale Øko"]
[null,null,null,null,null,null,null,null,null,null,null,null,null,null,null,null,null,34,"Vinterbyg","hkg",110,58,62,66,82,87,2600,2600,3000,3900,3900,null,null,null,null,null,0,448,595,0,1043,172,162,181,184,195,null,null,0.32300000000000001,6.8000000000000005E-2,20,0.39950000000000002,1.02,0,"Vinterbyg",4287,4287,6578,4907,4907,3635,3635,5843,3985,3985,9,5,19,8,7,6.5,103,1,3,3,3,3,1,1,1,1,null,null,null,null,2,1,30,"Byg","Vinterbyg"]
[null,null,null,null,null,null,null,null,null,null,null,null,null,null,null,null,null,35,"Vinterhvede 1. år","hkg",115,63,79,84,100,106,2900,2900,4000,4800,4800,-5,-7,-7,-8,-9,-9,450,998,0,1448,157,163,184,190,203,null,null,0.28899999999999998,7.6499999999999999E-2,20,0.40799999999999997,1.2749999999999999,0,"Vinterhvede 1. år",4713,4713,7286,5611,5611,3999,3999,6343,4502,4502,9,5,19,8,7,6.5,115,1,3,3,3,3,2,2,2,1.2,null,null,null,null,3,2,30,"Hvede","Vinterhvede 1. år"]
[null,null,null,null,null,null,null,null,null,null,null,null,null,null,null,null,null,36,"Vinterhvede 1. år Øko","hkg",175,27,27,50,50,50,2100,2100,2800,2800,2800,-5,-5,-5,-6,-6,-9,940,null,null,940,105,105,105,105,105,null,null,0.28899999999999998,7.6499999999999999E-2,20,0.40799999999999997,1.2749999999999999,null,"Vinterhvede 1. år Øko",4313,4313,6966,5050,5050,3735,3735,6227,4281,4281,9.3000000000000007,5,19,8,7,6.5,115,1,3,3,null,3,2,2,2,1.2,null,null,null,null,null,null,20,"Hvede","Vinterhvede 1. år Øko"]
[null,null,null,null,null,null,null,null,null,null,null,null,null,null,null,null,null,37,"Vinterhvede e. korn","hkg",115,57,71,76,91,96,2600,2600,3600,4400,4400,null,null,null,null,null,null,510,998,0,1508,175,181,202,208,221,null,null,0.28899999999999998,7.6499999999999999E-2,20,0.40799999999999997,1.2749999999999999,0,"Vinterhvede e. korn",4589,4589,7130,5435,5435,3937,3937,6270,4409,4409,9,5,19,8,7,6.5,115,1,3,3,3,3,2,2,2,1.2,null,null,null,null,3,2,30,"Hvede","Vinterhvede e. korn"]
[null,null,null,null,null,null,null,null,null,null,null,null,null,null,null,null,null,38,"Vinterhvede alle år","hkg",115,57,71,76,91,96,2600,2600,3600,4400,4400,null,null,null,null,null,null,510,998,0,1508,175,181,202,208,221,null,null,0.28899999999999998,7.6499999999999999E-2,20,0.40799999999999997,1.2749999999999999,0,"Vinterhvede, hvert år",4589,4589,7130,5435,5435,3937,3937,6270,4409,4409,9,5,19,8,7,6.5,115,1,3,3,3,3,2,2,2,1.2,null,null,null,null,3,2,30,"Hvede","Vinterhvede, hvert år"]
[null,null,null,null,null,null,null,null,null,null,null,null,null,null,null,null,null,39,"Vinterraps","hkg",280,32,40,40,45,47,0,0,0,0,0,5,7,7,8,9,9,425,1380,125,1930,190,202,202,210,213,null,null,0.81899999999999995,6.8000000000000005E-2,20,1.365,1.3939999999999999,2.6190476190476191,"Vinterraps",4148,4148,6354,4529,4529,4148,4148,6354,4529,4529,17,14,19,null,null,null,0,2,2,2,2,2,1,1,null,1,null,null,null,null,6,2,40,null,"Vinterraps"]
[null,null,null,null,null,null,null,null,null,null,null,null,null,null,null,null,null,40,"Vinterraps Øko","hkg",620,20,20,23,23,23,0,0,0,0,0,5,7,7,8,9,9,675,null,161,836,105,105,105,105,105,null,null,0.81899999999999995,6.8000000000000005E-2,20,1.365,1.3939999999999999,5,"Vinterraps Øko",4683,4683,6815,4915,4915,4683,4683,6815,4915,4915,18,14,19,null,null,null,0,2,2,2,null,2,1,1,null,1,null,null,null,null,null,null,35,null,"Vinterraps Øko"]
[null,null,null,null,null,null,null,null,null,null,null,null,null,null,null,null,null,41,"Vinterrug","hkg",100,53,66,66,79,82,3400,3400,4300,5400,5400,null,null,null,null,null,null,360,710,0,1070,138,138,152,153,162,null,null,0.28899999999999998,7.6499999999999999E-2,20,0.46750000000000003,1.02,0,"Vinterrug",4533,4533,6981,5337,5337,3715,3715,5976,4104,4104,9,5,19,8,7,6.5,110,1,3,3,3,3,2,2,2,1.6,null,null,null,null,2,2,30,"Rug","Vinterrug"]
[null,null,null,null,null,null,null,null,null,null,null,null,null,null,null,null,null,42,"Vinterrug Øko","hkg",110,37,37,48,57,57,2600,2600,3800,3800,3800,null,null,null,null,null,null,460,null,null,460,105,105,105,105,105,null,null,0.28899999999999998,7.6999999999999999E-2,20,0.46800000000000003,1.02,0,"Vinterrug Øko",4573,4573,7117,5352,5352,3891,3891,6197,4391,4391,9.3000000000000007,5,19,8,7,6.5,110,1,3,3,null,3,2,2,2,1.6,null,null,null,null,null,null,20,"Rug","Vinterrug Øko"]
[null,null,null,null,null,null,null,null,null,null,null,null,null,null,null,null,null,43,"Vårbyg, foder","hkg",110,47,54,60,67,71,2400,2400,3100,3500,3500,null,null,null,null,null,null,392,365,0,757,141,137,159,144,152,null,2.5,0.32300000000000001,7.6499999999999999E-2,20,0.39950000000000002,1.02,0,"Vårbyg, foder",3961,3961,6092,4498,4498,3350,3350,5336,3659,3659,9,5,20,8,7,6.5,102,1,1,1,1,1,2,2,2,1,null,null,null,null,2,1,30,"Byg","Vårbyg, foder"]
[null,null,null,null,null,null,null,null,null,null,null,null,null,null,null,null,null,44,"Vårbyg, foder Øko","hkg",120,27,27,40,40,40,1600,1600,1900,1900,1900,null,null,null,null,null,null,697,null,null,697,105,105,105,105,105,null,2.5,0.32,0.08,20,0.4,1.02,0,"Vårbyg, foder Øko",4400,4400,6539,4907,4907,3925,3925,5987,4340,4340,9.3000000000000007,5,20,8,7,6.5,102,1,1,1,null,1,2,2,2,1,null,null,null,null,null,null,20,"Byg","Vårbyg, foder Øko"]
[null,null,null,null,null,null,null,null,null,null,null,null,null,null,null,null,null,45,"Vårbyg, malt","hkg",120,47,54,60,67,71,2400,2400,3100,3500,3500,null,null,null,null,null,null,434,365,0,799,140,134,129,124,132,null,2.5,0.32300000000000001,7.6499999999999999E-2,20,0.39950000000000002,1.02,0,"Vårbyg, malt",3961,3961,6092,4498,4498,3350,3350,5336,3659,3659,9,5,20,null,null,null,0,2,1,1,1,1,2,2,2,1,null,null,null,null,2,1,0,null,"Vårbyg, malt"]
[null,null,null,null,null,null,null,null,null,null,null,null,null,null,null,null,null,46,"Vårbyg, malt Øko","hkg",150,27,27,35,40,40,1600,1600,1900,1900,1900,null,null,null,null,null,null,697,null,null,697,105,105,105,105,105,null,2.5,0.32,0.08,20,0.4,1.02,0,"Vårbyg, malt Øko",4400,4400,6539,4907,4907,3925,3925,5987,4340,4340,9.3000000000000007,5,0,8,7,6.5,0,1,1,1,null,1,2,2,2,1,null,null,null,null,null,null,0,"Byg","Vårbyg, malt Øko"]
[null,null,null,null,null,null,null,null,null,null,null,null,null,null,null,null,null,47,"Vårbyg/ært Øko","hkg",250,29,29,42,42,42,1600,1600,1900,1900,1900,null,null,null,null,null,null,1012,null,null,1012,0,0,0,0,0,null,null,null,null,20,null,null,null,"Vårbyg/ært Øko",4050,4050,5985,4340,4340,4050,4050,5985,4340,4340,14.6,14.6,0,null,null,null,null,2,1,1,null,1,2,2,null,1,null,null,null,null,null,null,20,null,"Vårbyg/ært Øko"]
[null,null,null,null,null,null,null,null,null,null,null,null,null,null,null,null,null,48,"Vårhvede","hkg",115,43,49,55,61,65,1800,1800,2400,2700,2700,null,null,null,null,null,null,612,350,0,962,168,163,187,172,178,null,2.5,0.32300000000000001,7.6499999999999999E-2,20,0.39950000000000002,1.02,0,"Vårhvede",3785,3785,5897,4259,4259,3299,3299,5286,3586,3586,9,5,20,8,7,6.5,115,1,1,1,1,1,2,2,2,1,null,null,null,null,2,1,30,"Hvede","Vårhvede"]
[null,null,null,null,null,null,null,null,null,null,null,null,null,null,null,null,null,49,"Vårhvede Øko","hkg",175,27,27,38,38,38,1300,1300,1500,1500,1500,null,null,null,null,null,null,945,null,null,945,105,105,105,105,105,null,2.5,0.32,0.08,20,0.4,1.02,0,"Vårhvede Øko",4326,4326,6489,4778,4778,3925,3925,6031,4309,4309,9.3000000000000007,5,20,8,7,6.5,115,1,1,1,null,1,2,2,2,1,null,null,null,null,null,null,20,"Hvede","Vårhvede Øko"]
[null,null,null,null,null,null,null,null,null,null,null,null,null,null,null,null,null,50,"Vårhvede/ært Øko","hkg",250,29,29,34,36,36,1300,1300,1500,1500,1500,null,null,null,null,null,null,1107,null,null,1107,55,55,55,55,55,null,null,null,null,20,null,null,null,"Vårhvede/ært Øko",4050,4050,5985,4340,4340,4050,4050,5985,4340,4340,14.6,14.6,20,null,null,null,null,null,1,1,1,1,2,2,null,1,null,null,null,null,null,null,20,null,"Vårhvede/ært Øko"]
[null,null,null,null,null,null,null,null,null,null,null,null,null,null,null,null,null,51,"Vårtriticale Øko","hkg",160,32,32,38,38,38,1500,1500,2100,2100,2100,null,null,null,null,null,null,945,null,null,945,105,105,105,105,105,null,2.5,0.32,7.0000000000000007E-2,20,0.4,1.02,0,"Vårtriticale Øko",4326,4326,6489,4778,4778,3925,3925,6031,4309,4309,10,5,20,8,7,6.5,113,1,1,1,null,1,2,2,2,1,null,null,null,null,null,null,20,"Triticale","Vårtriticale Øko"]
[null,null,null,null,null,null,null,null,null,null,null,null,null,null,null,null,null,52,"Vårraps  ","hkg",280,20,23,25,26,27,0,0,0,0,0,5,7,7,9,9,9,561,500,125,1186,137,126,144,121,123,null,2.5,0.81899999999999995,6.8000000000000005E-2,20,1.365,1.3939999999999999,4.0740740740740744,"Vårraps",3051,3051,5218,3288,3288,3051,3051,5218,3288,3288,17,14,20,null,null,null,0,2,1,1,1,1,2,2,null,1,null,null,null,null,2,1,34,null,"Vårraps"]
[null,null,null,null,null,null,null,null,null,null,null,null,null,null,null,null,null,53,"Sædskifte 1","hkg",{"$f":"(IF(I68<>\"\",I68,VLOOKUP($CU$159,_Afg07,U285))*$D$68*IF($F$68<>\"\",$F$68,VLOOKUP($CU$159,_Afg07,Udbyttenr))+IF(I70<>\"\",I70,VLOOKUP($CU$161,_Afg07,U285))*$D$70*IF($F$70<>\"\",$F$70,VLOOKUP($CU$161,_Afg07,Udbyttenr))+IF(I72<>\"\",I72,VLOOKUP($CU$163,_Afg07,U285))*$D$72*IF($F$72<>\"\",$F$72,VLOOKUP($CU$163,_Afg07,Udbyttenr))+IF(I74<>\"\",I74,VLOOKUP($CU$165,_Afg07,U285))*$D$74*IF($F$74<>\"\",$F$74,VLOOKUP($CU$165,_Afg07,Udbyttenr))+IF(I76<>\"\",I76,VLOOKUP($CU$167,_Afg07,U285))*$D$76*IF($F$76<>\"\",$F$76,VLOOKUP($CU$167,_Afg07,Udbyttenr))+IF(I78<>\"\",I78,VLOOKUP($CU$169,_Afg07,U285))*$D$78*IF($F$78<>\"\",$F$78,VLOOKUP($CU$169,_Afg07,Udbyttenr))+IF(I80<>\"\",I80,VLOOKUP($CU$171,_Afg07,U285))*$D$80*IF($F$80<>\"\",$F$80,VLOOKUP($CU$171,_Afg07,Udbyttenr)))/($D$82*VLOOKUP($R$340,_Afg07,Udbyttenr))","v":{"$error":"#DIV/0!"}},{"$f":"(IF($F$68<>\"\",$F$68,VLOOKUP($CU$159,_Afg07,V285))*$D$68+IF($F$70<>\"\",$F$70,VLOOKUP($CU$161,_Afg07,V285))*$D$70+IF($F$72<>\"\",$F$72,VLOOKUP($CU$163,_Afg07,V285))*$D$72+IF($F$74<>\"\",$F$74,VLOOKUP($CU$165,_Afg07,V285))*$D$74+IF($F$76<>\"\",$F$76,VLOOKUP($CU$167,_Afg07,V285))*$D$76+IF($F$78<>\"\",$F$78,VLOOKUP($CU$169,_Afg07,V285))*$D$78+IF($F$80<>\"\",$F$80,VLOOKUP($CU$171,_Afg07,V285))*$D$80)/$D$82","v":{"$error":"#DIV/0!"}},{"$f":"(IF($F$68<>\"\",$F$68,VLOOKUP($CU$159,_Afg07,W285))*$D$68+IF($F$70<>\"\",$F$70,VLOOKUP($CU$161,_Afg07,W285))*$D$70+IF($F$72<>\"\",$F$72,VLOOKUP($CU$163,_Afg07,W285))*$D$72+IF($F$74<>\"\",$F$74,VLOOKUP($CU$165,_Afg07,W285))*$D$74+IF($F$76<>\"\",$F$76,VLOOKUP($CU$167,_Afg07,W285))*$D$76+IF($F$78<>\"\",$F$78,VLOOKUP($CU$169,_Afg07,W285))*$D$78+IF($F$80<>\"\",$F$80,VLOOKUP($CU$171,_Afg07,W285))*$D$80)/$D$82","v":{"$error":"#DIV/0!"}},{"$f":"(IF($F$68<>\"\",$F$68,VLOOKUP($CU$159,_Afg07,X285))*$D$68+IF($F$70<>\"\",$F$70,VLOOKUP($CU$161,_Afg07,X285))*$D$70+IF($F$72<>\"\",$F$72,VLOOKUP($CU$163,_Afg07,X285))*$D$72+IF($F$74<>\"\",$F$74,VLOOKUP($CU$165,_Afg07,X285))*$D$74+IF($F$76<>\"\",$F$76,VLOOKUP($CU$167,_Afg07,X285))*$D$76+IF($F$78<>\"\",$F$78,VLOOKUP($CU$169,_Afg07,X285))*$D$78+IF($F$80<>\"\",$F$80,VLOOKUP($CU$171,_Afg07,X285))*$D$80)/$D$82","v":{"$error":"#DIV/0!"}},{"$f":"(IF($F$68<>\"\",$F$68,VLOOKUP($CU$159,_Afg07,Y285))*$D$68+IF($F$70<>\"\",$F$70,VLOOKUP($CU$161,_Afg07,Y285))*$D$70+IF($F$72<>\"\",$F$72,VLOOKUP($CU$163,_Afg07,Y285))*$D$72+IF($F$74<>\"\",$F$74,VLOOKUP($CU$165,_Afg07,Y285))*$D$74+IF($F$76<>\"\",$F$76,VLOOKUP($CU$167,_Afg07,Y285))*$D$76+IF($F$78<>\"\",$F$78,VLOOKUP($CU$169,_Afg07,Y285))*$D$78+IF($F$80<>\"\",$F$80,VLOOKUP($CU$171,_Afg07,Y285))*$D$80)/$D$82","v":{"$error":"#DIV/0!"}},{"$f":"(IF($F$68<>\"\",$F$68,VLOOKUP($CU$159,_Afg07,Z285))*$D$68+IF($F$70<>\"\",$F$70,VLOOKUP($CU$161,_Afg07,Z285))*$D$70+IF($F$72<>\"\",$F$72,VLOOKUP($CU$163,_Afg07,Z285))*$D$72+IF($F$74<>\"\",$F$74,VLOOKUP($CU$165,_Afg07,Z285))*$D$74+IF($F$76<>\"\",$F$76,VLOOKUP($CU$167,_Afg07,Z285))*$D$76+IF($F$78<>\"\",$F$78,VLOOKUP($CU$169,_Afg07,Z285))*$D$78+IF($F$80<>\"\",$F$80,VLOOKUP($CU$171,_Afg07,Z285))*$D$80)/$D$82","v":{"$error":"#DIV/0!"}},{"$f":"(VLOOKUP($CU$159,_Afg07,AA285)*$D$68+VLOOKUP($CU$161,_Afg07,AA285)*$D$70+VLOOKUP($CU$163,_Afg07,AA285)*$D$72+VLOOKUP($CU$165,_Afg07,AA285)*$D$74+VLOOKUP($CU$167,_Afg07,AA285)*$D$76+VLOOKUP($CU$169,_Afg07,AA285)*$D$78+VLOOKUP($CU$171,_Afg07,AA285)*$D$80)/$D$82","v":{"$error":"#DIV/0!"}},{"$error":"#DIV/0!"},{"$error":"#DIV/0!"},{"$error":"#DIV/0!"},{"$error":"#DIV/0!"},{"$error":"#DIV/0!"},{"$error":"#DIV/0!"},{"$error":"#DIV/0!"},{"$error":"#DIV/0!"},{"$error":"#DIV/0!"},{"$error":"#DIV/0!"},{"$error":"#DIV/0!"},{"$error":"#DIV/0!"},{"$error":"#DIV/0!"},{"$error":"#DIV/0!"},{"$error":"#DIV/0!"},{"$error":"#DIV/0!"},{"$error":"#DIV/0!"},{"$error":"#DIV/0!"},{"$error":"#DIV/0!"},{"$error":"#DIV/0!"},{"$error":"#DIV/0!"},{"$f":"(VLOOKUP($CU$159,_Afg07,AW285)*$D$68*IF($F$68<>\"\",$F$68,VLOOKUP($CU$159,_Afg07,Udbyttenr))+VLOOKUP($CU$161,_Afg07,AW285)*$D$70*IF($F$70<>\"\",$F$70,VLOOKUP($CU$161,_Afg07,Udbyttenr))+VLOOKUP($CU$163,_Afg07,AW285)*$D$72*IF($F$72<>\"\",$F$72,VLOOKUP($CU$163,_Afg07,Udbyttenr))+VLOOKUP($CU$165,_Afg07,AW285)*$D$74*IF($F$74<>\"\",$F$74,VLOOKUP($CU$165,_Afg07,Udbyttenr))+VLOOKUP($CU$167,_Afg07,AW285)*$D$76*IF($F$76<>\"\",$F$76,VLOOKUP($CU$167,_Afg07,Udbyttenr))+VLOOKUP($CU$169,_Afg07,AW285)*$D$78*IF($F$78<>\"\",$F$78,VLOOKUP($CU$169,_Afg07,Udbyttenr))+VLOOKUP($CU$171,_Afg07,AW285)*$D$80*IF($F$80<>\"\",$F$80,VLOOKUP($CU$171,_Afg07,Udbyttenr)))/($D$82*VLOOKUP($R$340,_Afg07,Udbyttenr))","v":{"$error":"#DIV/0!"}},{"$f":"(VLOOKUP($CU$159,_Afg07,AX285)*$D$68*VLOOKUP($CU$159,_Afg07,Halmnr)+VLOOKUP($CU$161,_Afg07,AX285)*$D$70*VLOOKUP($CU$161,_Afg07,Halmnr)+VLOOKUP($CU$163,_Afg07,AX285)*$D$72*VLOOKUP($CU$163,_Afg07,Halmnr)+VLOOKUP($CU$165,_Afg07,AX285)*$D$74*VLOOKUP($CU$165,_Afg07,Halmnr)+VLOOKUP($CU$167,_Afg07,AX285)*$D$76*VLOOKUP($CU$167,_Afg07,Halmnr)+VLOOKUP($CU$169,_Afg07,AX285)*$D$78*VLOOKUP($CU$169,_Afg07,Halmnr)+VLOOKUP($CU$171,_Afg07,AX285)*$D$80*VLOOKUP($CU$171,_Afg07,Halmnr))/($D$82*VLOOKUP($R$340,_Afg07,Halmnr))","v":{"$error":"#DIV/0!"}},{"$f":"(VLOOKUP($CU$159,_Afg07,AY285)*$D$68+VLOOKUP($CU$161,_Afg07,AY285)*$D$70+VLOOKUP($CU$163,_Afg07,AY285)*$D$72+VLOOKUP($CU$165,_Afg07,AY285)*$D$74+VLOOKUP($CU$167,_Afg07,AY285)*$D$76+VLOOKUP($CU$169,_Afg07,AY285)*$D$78+VLOOKUP($CU$171,_Afg07,AY285)*$D$80)/$D$82","v":{"$error":"#DIV/0!"}},{"$f":"(VLOOKUP($CU$159,_Afg07,AZ285)*$D$68*IF($F$68<>\"\",$F$68,VLOOKUP($CU$159,_Afg07,Udbyttenr))+VLOOKUP($CU$161,_Afg07,AZ285)*$D$70*IF($F$70<>\"\",$F$70,VLOOKUP($CU$161,_Afg07,Udbyttenr))+VLOOKUP($CU$163,_Afg07,AZ285)*$D$72*IF($F$72<>\"\",$F$72,VLOOKUP($CU$163,_Afg07,Udbyttenr))+VLOOKUP($CU$165,_Afg07,AZ285)*$D$74*IF($F$74<>\"\",$F$74,VLOOKUP($CU$165,_Afg07,Udbyttenr))+VLOOKUP($CU$167,_Afg07,AZ285)*$D$76*IF($F$76<>\"\",$F$76,VLOOKUP($CU$167,_Afg07,Udbyttenr))+VLOOKUP($CU$169,_Afg07,AZ285)*$D$78*IF($F$78<>\"\",$F$78,VLOOKUP($CU$169,_Afg07,Udbyttenr))+VLOOKUP($CU$171,_Afg07,AZ285)*$D$80*IF($F$80<>\"\",$F$80,VLOOKUP($CU$171,_Afg07,Udbyttenr)))/($D$82*VLOOKUP($R$340,_Afg07,Udbyttenr))","v":{"$error":"#DIV/0!"}},{"$f":"(VLOOKUP($CU$159,_Afg07,BA285)*$D$68*VLOOKUP($CU$159,_Afg07,Halmnr)+VLOOKUP($CU$161,_Afg07,BA285)*$D$70*VLOOKUP($CU$161,_Afg07,Halmnr)+VLOOKUP($CU$163,_Afg07,BA285)*$D$72*VLOOKUP($CU$163,_Afg07,Halmnr)+VLOOKUP($CU$165,_Afg07,BA285)*$D$74*VLOOKUP($CU$165,_Afg07,Halmnr)+VLOOKUP($CU$167,_Afg07,BA285)*$D$76*VLOOKUP($CU$167,_Afg07,Halmnr)+VLOOKUP($CU$169,_Afg07,BA285)*$D$78*VLOOKUP($CU$169,_Afg07,Halmnr)+VLOOKUP($CU$171,_Afg07,BA285)*$D$80*VLOOKUP($CU$171,_Afg07,Halmnr))/($D$82*VLOOKUP($R$340,_Afg07,Halmnr))","v":{"$error":"#DIV/0!"}},{"$f":"(VLOOKUP($CU$159,_Afg07,BB285)*$D$68*IF($F$68<>\"\",$F$68,VLOOKUP($CU$159,_Afg07,Udbyttenr))+VLOOKUP($CU$161,_Afg07,BB285)*$D$70*IF($F$70<>\"\",$F$70,VLOOKUP($CU$161,_Afg07,Udbyttenr))+VLOOKUP($CU$163,_Afg07,BB285)*$D$72*IF($F$72<>\"\",$F$72,VLOOKUP($CU$163,_Afg07,Udbyttenr))+VLOOKUP($CU$165,_Afg07,BB285)*$D$74*IF($F$74<>\"\",$F$74,VLOOKUP($CU$165,_Afg07,Udbyttenr))+VLOOKUP($CU$167,_Afg07,BB285)*$D$76*IF($F$76<>\"\",$F$76,VLOOKUP($CU$167,_Afg07,Udbyttenr))+VLOOKUP($CU$169,_Afg07,BB285)*$D$78*IF($F$78<>\"\",$F$78,VLOOKUP($CU$169,_Afg07,Udbyttenr))+VLOOKUP($CU$171,_Afg07,BB285)*$D$80*IF($F$80<>\"\",$F$80,VLOOKUP($CU$171,_Afg07,Udbyttenr)))/($D$82*VLOOKUP($R$340,_Afg07,Udbyttenr))","v":{"$error":"#DIV/0!"}},"Sædskifte 1",{"$f":"(VLOOKUP($CU$159,_Afg07,BD285)*$D$68+VLOOKUP($CU$161,_Afg07,BD285)*$D$70+VLOOKUP($CU$163,_Afg07,BD285)*$D$72+VLOOKUP($CU$165,_Afg07,BD285)*$D$74+VLOOKUP($CU$167,_Afg07,BD285)*$D$76+VLOOKUP($CU$169,_Afg07,BD285)*$D$78+VLOOKUP($CU$171,_Afg07,BD285)*$D$80)/$D$82","v":{"$error":"#DIV/0!"}},{"$error":"#DIV/0!"},{"$error":"#DIV/0!"},{"$error":"#DIV/0!"},{"$error":"#DIV/0!"},{"$error":"#DIV/0!"},{"$error":"#DIV/0!"},{"$error":"#DIV/0!"},{"$error":"#DIV/0!"},{"$error":"#DIV/0!"},{"$f":"(IF(AND(VLOOKUP($CU$159,_Afg07,$BU$285)=1,$CX$5=4),0,VLOOKUP($CU$159,_Afg07,BN285)*$D$68*IF($F$68<>\"\",$F$68,VLOOKUP($CU$159,_Afg07,Udbyttenr)))+IF(AND(VLOOKUP($CU$161,_Afg07,$BU$285)=1,$CX$5=4),0,VLOOKUP($CU$161,_Afg07,BN285)*$D$70*IF($F$70<>\"\",$F$70,VLOOKUP($CU$161,_Afg07,Udbyttenr)))+IF(AND(VLOOKUP($CU$163,_Afg07,$BU$285)=1,$CX$5=4),0,VLOOKUP($CU$163,_Afg07,BN285)*$D$72*IF($F$72<>\"\",$F$72,VLOOKUP($CU$163,_Afg07,Udbyttenr)))+IF(AND(VLOOKUP($CU$165,_Afg07,$BU$285)=1,$CX$5=4),0,VLOOKUP($CU$165,_Afg07,BN285)*$D$74*IF($F$74<>\"\",$F$74,VLOOKUP($CU$165,_Afg07,Udbyttenr)))+IF(AND(VLOOKUP($CU$167,_Afg07,$BU$285)=1,$CX$5=4),0,VLOOKUP($CU$167,_Afg07,BN285)*$D$76*IF($F$76<>\"\",$F$76,VLOOKUP($CU$167,_Afg07,Udbyttenr)))+IF(AND(VLOOKUP($CU$169,_Afg07,$BU$285)=1,$CX$5=4),0,VLOOKUP($CU$169,_Afg07,BN285)*$D$78*IF($F$78<>\"\",$F$78,VLOOKUP($CU$169,_Afg07,Udbyttenr)))+IF(AND(VLOOKUP($CU$171,_Afg07,$BU$285)=1,$CX$5=4),0,VLOOKUP($CU$171,_Afg07,BN285)*$D$80*IF($F$80<>\"\",$F$80,VLOOKUP($CU$171,_Afg07,Udbyttenr))))/($D$82*VLOOKUP($R$340,_Afg07,Udbyttenr))","v":{"$error":"#DIV/0!"}},{"$f":"(IF(AND(VLOOKUP($CU$159,_Afg07,$BU$285)=1,$CX$5=4),0,VLOOKUP($CU$159,_Afg07,BO285)*$D$68*IF($F$68<>\"\",$F$68,VLOOKUP($CU$159,_Afg07,Udbyttenr)))+IF(AND(VLOOKUP($CU$161,_Afg07,$BU$285)=1,$CX$5=4),0,VLOOKUP($CU$161,_Afg07,BO285)*$D$70*IF($F$70<>\"\",$F$70,VLOOKUP($CU$161,_Afg07,Udbyttenr)))+IF(AND(VLOOKUP($CU$163,_Afg07,$BU$285)=1,$CX$5=4),0,VLOOKUP($CU$163,_Afg07,BO285)*$D$72*IF($F$72<>\"\",$F$72,VLOOKUP($CU$163,_Afg07,Udbyttenr)))+IF(AND(VLOOKUP($CU$165,_Afg07,$BU$285)=1,$CX$5=4),0,VLOOKUP($CU$165,_Afg07,BO285)*$D$74*IF($F$74<>\"\",$F$74,VLOOKUP($CU$165,_Afg07,Udbyttenr)))+IF(AND(VLOOKUP($CU$167,_Afg07,$BU$285)=1,$CX$5=4),0,VLOOKUP($CU$167,_Afg07,BO285)*$D$76*IF($F$76<>\"\",$F$76,VLOOKUP($CU$167,_Afg07,Udbyttenr)))+IF(AND(VLOOKUP($CU$169,_Afg07,$BU$285)=1,$CX$5=4),0,VLOOKUP($CU$169,_Afg07,BO285)*$D$78*IF($F$78<>\"\",$F$78,VLOOKUP($CU$169,_Afg07,Udbyttenr)))+IF(AND(VLOOKUP($CU$171,_Afg07,$BU$285)=1,$CX$5=4),0,VLOOKUP($CU$171,_Afg07,BO285)*$D$80*IF($F$80<>\"\",$F$80,VLOOKUP($CU$171,_Afg07,Udbyttenr))))/($D$82*VLOOKUP($R$340,_Afg07,Udbyttenr))","v":{"$error":"#DIV/0!"}},{"$f":"(IF(AND(VLOOKUP($CU$159,_Afg07,$BU$285)=1,$CX$5=4),0,VLOOKUP($CU$159,_Afg07,BP285)*$D$68*IF($F$68<>\"\",$F$68,VLOOKUP($CU$159,_Afg07,Udbyttenr)))+IF(AND(VLOOKUP($CU$161,_Afg07,$BU$285)=1,$CX$5=4),0,VLOOKUP($CU$161,_Afg07,BP285)*$D$70*IF($F$70<>\"\",$F$70,VLOOKUP($CU$161,_Afg07,Udbyttenr)))+IF(AND(VLOOKUP($CU$163,_Afg07,$BU$285)=1,$CX$5=4),0,VLOOKUP($CU$163,_Afg07,BP285)*$D$72*IF($F$72<>\"\",$F$72,VLOOKUP($CU$163,_Afg07,Udbyttenr)))+IF(AND(VLOOKUP($CU$165,_Afg07,$BU$285)=1,$CX$5=4),0,VLOOKUP($CU$165,_Afg07,BP285)*$D$74*IF($F$74<>\"\",$F$74,VLOOKUP($CU$165,_Afg07,Udbyttenr)))+IF(AND(VLOOKUP($CU$167,_Afg07,$BU$285)=1,$CX$5=4),0,VLOOKUP($CU$167,_Afg07,BP285)*$D$76*IF($F$76<>\"\",$F$76,VLOOKUP($CU$167,_Afg07,Udbyttenr)))+IF(AND(VLOOKUP($CU$169,_Afg07,$BU$285)=1,$CX$5=4),0,VLOOKUP($CU$169,_Afg07,BP285)*$D$78*IF($F$78<>\"\",$F$78,VLOOKUP($CU$169,_Afg07,Udbyttenr)))+IF(AND(VLOOKUP($CU$171,_Afg07,$BU$285)=1,$CX$5=4),0,VLOOKUP($CU$171,_Afg07,BP285)*$D$80*IF($F$80<>\"\",$F$80,VLOOKUP($CU$171,_Afg07,Udbyttenr))))/($D$82*VLOOKUP($R$340,_Afg07,Udbyttenr))","v":{"$error":"#DIV/0!"}},{"$f":"(IF(VLOOKUP($CU$159,_Afg07,$BU$285)=1,VLOOKUP($CU$159,_Afg07,BQ285)*$D$68*IF($F$68<>\"\",$F$68,VLOOKUP($CU$159,_Afg07,Udbyttenr)),0)+IF(VLOOKUP($CU$161,_Afg07,$BU$285)=1,VLOOKUP($CU$161,_Afg07,BQ285)*$D$70*IF($F$70<>\"\",$F$70,VLOOKUP($CU$161,_Afg07,Udbyttenr)),0)+IF(VLOOKUP($CU$163,_Afg07,$BU$285)=1,VLOOKUP($CU$163,_Afg07,BQ285)*$D$72*IF($F$72<>\"\",$F$72,VLOOKUP($CU$163,_Afg07,Udbyttenr)),0)+IF(VLOOKUP($CU$165,_Afg07,$BU$285)=1,VLOOKUP($CU$165,_Afg07,BQ285)*$D$74*IF($F$74<>\"\",$F$74,VLOOKUP($CU$165,_Afg07,Udbyttenr)),0)+IF(VLOOKUP($CU$167,_Afg07,$BU$285)=1,VLOOKUP($CU$167,_Afg07,BQ285)*$D$76*IF($F$76<>\"\",$F$76,VLOOKUP($CU$167,_Afg07,Udbyttenr)),0)+IF(VLOOKUP($CU$169,_Afg07,$BU$285)=1,VLOOKUP($CU$169,_Afg07,BQ285)*$D$78*IF($F$78<>\"\",$F$78,VLOOKUP($CU$169,_Afg07,Udbyttenr)),0)+IF(VLOOKUP($CU$171,_Afg07,$BU$285)=1,VLOOKUP($CU$171,_Afg07,BQ285)*$D$80*IF($F$80<>\"\",$F$80,VLOOKUP($CU$171,_Afg07,Udbyttenr)),0))/($CX$173)","v":{"$error":"#DIV/0!"}},{"$f":"(IF(VLOOKUP($CU$159,_Afg07,$BU$285)=1,VLOOKUP($CU$159,_Afg07,BR285)*$D$68*IF($F$68<>\"\",$F$68,VLOOKUP($CU$159,_Afg07,Udbyttenr)),0)+IF(VLOOKUP($CU$161,_Afg07,$BU$285)=1,VLOOKUP($CU$161,_Afg07,BR285)*$D$70*IF($F$70<>\"\",$F$70,VLOOKUP($CU$161,_Afg07,Udbyttenr)),0)+IF(VLOOKUP($CU$163,_Afg07,$BU$285)=1,VLOOKUP($CU$163,_Afg07,BR285)*$D$72*IF($F$72<>\"\",$F$72,VLOOKUP($CU$163,_Afg07,Udbyttenr)),0)+IF(VLOOKUP($CU$165,_Afg07,$BU$285)=1,VLOOKUP($CU$165,_Afg07,BR285)*$D$74*IF($F$74<>\"\",$F$74,VLOOKUP($CU$165,_Afg07,Udbyttenr)),0)+IF(VLOOKUP($CU$167,_Afg07,$BU$285)=1,VLOOKUP($CU$167,_Afg07,BR285)*$D$76*IF($F$76<>\"\",$F$76,VLOOKUP($CU$167,_Afg07,Udbyttenr)),0)+IF(VLOOKUP($CU$169,_Afg07,$BU$285)=1,VLOOKUP($CU$169,_Afg07,BR285)*$D$78*IF($F$78<>\"\",$F$78,VLOOKUP($CU$169,_Afg07,Udbyttenr)),0)+IF(VLOOKUP($CU$171,_Afg07,$BU$285)=1,VLOOKUP($CU$171,_Afg07,BR285)*$D$80*IF($F$80<>\"\",$F$80,VLOOKUP($CU$171,_Afg07,Udbyttenr)),0))/($CX$173)","v":{"$error":"#DIV/0!"}},{"$f":"(IF(VLOOKUP($CU$159,_Afg07,$BU$285)=1,VLOOKUP($CU$159,_Afg07,BS285)*$D$68*IF($F$68<>\"\",$F$68,VLOOKUP($CU$159,_Afg07,Udbyttenr)),0)+IF(VLOOKUP($CU$161,_Afg07,$BU$285)=1,VLOOKUP($CU$161,_Afg07,BS285)*$D$70*IF($F$70<>\"\",$F$70,VLOOKUP($CU$161,_Afg07,Udbyttenr)),0)+IF(VLOOKUP($CU$163,_Afg07,$BU$285)=1,VLOOKUP($CU$163,_Afg07,BS285)*$D$72*IF($F$72<>\"\",$F$72,VLOOKUP($CU$163,_Afg07,Udbyttenr)),0)+IF(VLOOKUP($CU$165,_Afg07,$BU$285)=1,VLOOKUP($CU$165,_Afg07,BS285)*$D$74*IF($F$74<>\"\",$F$74,VLOOKUP($CU$165,_Afg07,Udbyttenr)),0)+IF(VLOOKUP($CU$167,_Afg07,$BU$285)=1,VLOOKUP($CU$167,_Afg07,BS285)*$D$76*IF($F$76<>\"\",$F$76,VLOOKUP($CU$167,_Afg07,Udbyttenr)),0)+IF(VLOOKUP($CU$169,_Afg07,$BU$285)=1,VLOOKUP($CU$169,_Afg07,BS285)*$D$78*IF($F$78<>\"\",$F$78,VLOOKUP($CU$169,_Afg07,Udbyttenr)),0)+IF(VLOOKUP($CU$171,_Afg07,$BU$285)=1,VLOOKUP($CU$171,_Afg07,BS285)*$D$80*IF($F$80<>\"\",$F$80,VLOOKUP($CU$171,_Afg07,Udbyttenr)),0))/($CX$173)","v":{"$error":"#DIV/0!"}},{"$f":"(IF(VLOOKUP($CU$159,_Afg07,$BU$285)=1,VLOOKUP($CU$159,_Afg07,BT285)*$D$68*IF($F$68<>\"\",$F$68,VLOOKUP($CU$159,_Afg07,Udbyttenr)),0)+IF(VLOOKUP($CU$161,_Afg07,$BU$285)=1,VLOOKUP($CU$161,_Afg07,BT285)*$D$70*IF($F$70<>\"\",$F$70,VLOOKUP($CU$161,_Afg07,Udbyttenr)),0)+IF(VLOOKUP($CU$163,_Afg07,$BU$285)=1,VLOOKUP($CU$163,_Afg07,BT285)*$D$72*IF($F$72<>\"\",$F$72,VLOOKUP($CU$163,_Afg07,Udbyttenr)),0)+IF(VLOOKUP($CU$165,_Afg07,$BU$285)=1,VLOOKUP($CU$165,_Afg07,BT285)*$D$74*IF($F$74<>\"\",$F$74,VLOOKUP($CU$165,_Afg07,Udbyttenr)),0)+IF(VLOOKUP($CU$167,_Afg07,$BU$285)=1,VLOOKUP($CU$167,_Afg07,BT285)*$D$76*IF($F$76<>\"\",$F$76,VLOOKUP($CU$167,_Afg07,Udbyttenr)),0)+IF(VLOOKUP($CU$169,_Afg07,$BU$285)=1,VLOOKUP($CU$169,_Afg07,BT285)*$D$78*IF($F$78<>\"\",$F$78,VLOOKUP($CU$169,_Afg07,Udbyttenr)),0)+IF(VLOOKUP($CU$171,_Afg07,$BU$285)=1,VLOOKUP($CU$171,_Afg07,BT285)*$D$80*IF($F$80<>\"\",$F$80,VLOOKUP($CU$171,_Afg07,Udbyttenr)),0))/($CX$173)","v":{"$error":"#DIV/0!"}},3,null,null,null,null,null,null,null,null,null,null,null,null,null,null,null,null,"Sædskifte 1"]
[null,null,null,null,null,null,null,null,null,null,null,null,null,null,null,null,null,54,"Sædskifte 2","hkg",{"$f":"(IF(I89<>\"\",I89,VLOOKUP($CU$160,_Afg07,U285))*$D$89*IF($F$89<>\"\",$F$89,VLOOKUP($CU$160,_Afg07,Udbyttenr))+IF(I91<>\"\",I91,VLOOKUP($CU$162,_Afg07,U285))*$D$91*IF($F$91<>\"\",$F$91,VLOOKUP($CU$162,_Afg07,Udbyttenr))+IF(I93<>\"\",I93,VLOOKUP($CU$164,_Afg07,U285))*$D$93*IF($F$93<>\"\",$F$93,VLOOKUP($CU$164,_Afg07,Udbyttenr))+IF(I95<>\"\",I95,VLOOKUP($CU$166,_Afg07,U285))*$D$95*IF($F$95<>\"\",$F$95,VLOOKUP($CU$166,_Afg07,Udbyttenr))+IF(I97<>\"\",I97,VLOOKUP($CU$168,_Afg07,U285))*$D$97*IF($F$97<>\"\",$F$97,VLOOKUP($CU$168,_Afg07,Udbyttenr))+IF(I99<>\"\",I99,VLOOKUP($CU$170,_Afg07,U285))*$D$99*IF($F$99<>\"\",$F$99,VLOOKUP($CU$170,_Afg07,Udbyttenr))+IF(I101<>\"\",I101,VLOOKUP($CU$172,_Afg07,U285))*$D$101*IF($F$101<>\"\",$F$101,VLOOKUP($CU$172,_Afg07,Udbyttenr)))/($D$103*VLOOKUP($R$341,_Afg07,Udbyttenr))","v":{"$error":"#DIV/0!"}},{"$f":"(IF($F$89<>\"\",$F$89,VLOOKUP($CU$160,_Afg07,V285))*$D$89+IF($F$91<>\"\",$F$91,VLOOKUP($CU$162,_Afg07,V285))*$D$91+IF($F$93<>\"\",$F$93,VLOOKUP($CU$164,_Afg07,V285))*$D$93+IF($F$95<>\"\",$F$95,VLOOKUP($CU$166,_Afg07,V285))*$D$95+IF($F$97<>\"\",$F$97,VLOOKUP($CU$168,_Afg07,V285))*$D$97+IF($F$99<>\"\",$F$99,VLOOKUP($CU$170,_Afg07,V285))*$D$99+IF($F$101<>\"\",$F$101,VLOOKUP($CU$172,_Afg07,V285))*$D$101)/$D$103","v":{"$error":"#DIV/0!"}},{"$f":"(IF($F$89<>\"\",$F$89,VLOOKUP($CU$160,_Afg07,W285))*$D$89+IF($F$91<>\"\",$F$91,VLOOKUP($CU$162,_Afg07,W285))*$D$91+IF($F$93<>\"\",$F$93,VLOOKUP($CU$164,_Afg07,W285))*$D$93+IF($F$95<>\"\",$F$95,VLOOKUP($CU$166,_Afg07,W285))*$D$95+IF($F$97<>\"\",$F$97,VLOOKUP($CU$168,_Afg07,W285))*$D$97+IF($F$99<>\"\",$F$99,VLOOKUP($CU$170,_Afg07,W285))*$D$99+IF($F$101<>\"\",$F$101,VLOOKUP($CU$172,_Afg07,W285))*$D$101)/$D$103","v":{"$error":"#DIV/0!"}},{"$f":"(IF($F$89<>\"\",$F$89,VLOOKUP($CU$160,_Afg07,X285))*$D$89+IF($F$91<>\"\",$F$91,VLOOKUP($CU$162,_Afg07,X285))*$D$91+IF($F$93<>\"\",$F$93,VLOOKUP($CU$164,_Afg07,X285))*$D$93+IF($F$95<>\"\",$F$95,VLOOKUP($CU$166,_Afg07,X285))*$D$95+IF($F$97<>\"\",$F$97,VLOOKUP($CU$168,_Afg07,X285))*$D$97+IF($F$99<>\"\",$F$99,VLOOKUP($CU$170,_Afg07,X285))*$D$99+IF($F$101<>\"\",$F$101,VLOOKUP($CU$172,_Afg07,X285))*$D$101)/$D$103","v":{"$error":"#DIV/0!"}},{"$f":"(IF($F$89<>\"\",$F$89,VLOOKUP($CU$160,_Afg07,Y285))*$D$89+IF($F$91<>\"\",$F$91,VLOOKUP($CU$162,_Afg07,Y285))*$D$91+IF($F$93<>\"\",$F$93,VLOOKUP($CU$164,_Afg07,Y285))*$D$93+IF($F$95<>\"\",$F$95,VLOOKUP($CU$166,_Afg07,Y285))*$D$95+IF($F$97<>\"\",$F$97,VLOOKUP($CU$168,_Afg07,Y285))*$D$97+IF($F$99<>\"\",$F$99,VLOOKUP($CU$170,_Afg07,Y285))*$D$99+IF($F$101<>\"\",$F$101,VLOOKUP($CU$172,_Afg07,Y285))*$D$101)/$D$103","v":{"$error":"#DIV/0!"}},{"$f":"(IF($F$89<>\"\",$F$89,VLOOKUP($CU$160,_Afg07,Z285))*$D$89+IF($F$91<>\"\",$F$91,VLOOKUP($CU$162,_Afg07,Z285))*$D$91+IF($F$93<>\"\",$F$93,VLOOKUP($CU$164,_Afg07,Z285))*$D$93+IF($F$95<>\"\",$F$95,VLOOKUP($CU$166,_Afg07,Z285))*$D$95+IF($F$97<>\"\",$F$97,VLOOKUP($CU$168,_Afg07,Z285))*$D$97+IF($F$99<>\"\",$F$99,VLOOKUP($CU$170,_Afg07,Z285))*$D$99+IF($F$101<>\"\",$F$101,VLOOKUP($CU$172,_Afg07,Z285))*$D$101)/$D$103","v":{"$error":"#DIV/0!"}},{"$f":"(VLOOKUP($CU$160,_Afg07,AA285)*$D$89+VLOOKUP($CU$162,_Afg07,AA285)*$D$91+VLOOKUP($CU$164,_Afg07,AA285)*$D$93+VLOOKUP($CU$166,_Afg07,AA285)*$D$95+VLOOKUP($CU$168,_Afg07,AA285)*$D$97+VLOOKUP($CU$170,_Afg07,AA285)*$D$99+VLOOKUP($CU$172,_Afg07,AA285)*$D$101)/$D$103","v":{"$error":"#DIV/0!"}},{"$error":"#DIV/0!"},{"$error":"#DIV/0!"},{"$error":"#DIV/0!"},{"$error":"#DIV/0!"},{"$error":"#DIV/0!"},{"$error":"#DIV/0!"},{"$error":"#DIV/0!"},{"$error":"#DIV/0!"},{"$error":"#DIV/0!"},{"$error":"#DIV/0!"},{"$error":"#DIV/0!"},{"$error":"#DIV/0!"},{"$error":"#DIV/0!"},{"$error":"#DIV/0!"},{"$error":"#DIV/0!"},{"$error":"#DIV/0!"},{"$error":"#DIV/0!"},{"$error":"#DIV/0!"},{"$error":"#DIV/0!"},{"$error":"#DIV/0!"},{"$error":"#DIV/0!"},{"$f":"(VLOOKUP($CU$160,_Afg07,AW285)*$D$89*IF($F$89<>\"\",$F$89,VLOOKUP($CU$160,_Afg07,Udbyttenr))+VLOOKUP($CU$162,_Afg07,AW285)*$D$91*IF($F$91<>\"\",$F$91,VLOOKUP($CU$162,_Afg07,Udbyttenr))+VLOOKUP($CU$164,_Afg07,AW285)*$D$93*IF($F$93<>\"\",$F$93,VLOOKUP($CU$164,_Afg07,Udbyttenr))+VLOOKUP($CU$166,_Afg07,AW285)*$D$95*IF($F$95<>\"\",$F$95,VLOOKUP($CU$166,_Afg07,Udbyttenr))+VLOOKUP($CU$168,_Afg07,AW285)*$D$97*IF($F$97<>\"\",$F$97,VLOOKUP($CU$168,_Afg07,Udbyttenr))+VLOOKUP($CU$170,_Afg07,AW285)*$D$99*IF($F$99<>\"\",$F$99,VLOOKUP($CU$170,_Afg07,Udbyttenr))+VLOOKUP($CU$172,_Afg07,AW285)*$D$101*IF($F$101<>\"\",$F$101,VLOOKUP($CU$172,_Afg07,Udbyttenr)))/($D$103*VLOOKUP($R$341,_Afg07,Udbyttenr))","v":{"$error":"#DIV/0!"}},{"$f":"(VLOOKUP($CU$160,_Afg07,AX285)*$D$89*VLOOKUP($CU$160,_Afg07,Halmnr)+VLOOKUP($CU$162,_Afg07,AX285)*$D$91*VLOOKUP($CU$162,_Afg07,Halmnr)+VLOOKUP($CU$164,_Afg07,AX285)*$D$93*VLOOKUP($CU$164,_Afg07,Halmnr)+VLOOKUP($CU$166,_Afg07,AX285)*$D$95*VLOOKUP($CU$166,_Afg07,Halmnr)+VLOOKUP($CU$168,_Afg07,AX285)*$D$97*VLOOKUP($CU$168,_Afg07,Halmnr)+VLOOKUP($CU$170,_Afg07,AX285)*$D$99*VLOOKUP($CU$170,_Afg07,Halmnr)+VLOOKUP($CU$172,_Afg07,AX285)*$D$101*VLOOKUP($CU$172,_Afg07,Halmnr))/($D$103*VLOOKUP($R$341,_Afg07,Halmnr))","v":{"$error":"#DIV/0!"}},{"$f":"(VLOOKUP($CU$160,_Afg07,AY285)*$D$89+VLOOKUP($CU$162,_Afg07,AY285)*$D$91+VLOOKUP($CU$164,_Afg07,AY285)*$D$93+VLOOKUP($CU$166,_Afg07,AY285)*$D$95+VLOOKUP($CU$168,_Afg07,AY285)*$D$97+VLOOKUP($CU$170,_Afg07,AY285)*$D$99+VLOOKUP($CU$172,_Afg07,AY285)*$D$101)/$D$103","v":{"$error":"#DIV/0!"}},{"$f":"(VLOOKUP($CU$160,_Afg07,AZ285)*$D$89*IF($F$89<>\"\",$F$89,VLOOKUP($CU$160,_Afg07,Udbyttenr))+VLOOKUP($CU$162,_Afg07,AZ285)*$D$91*IF($F$91<>\"\",$F$91,VLOOKUP($CU$162,_Afg07,Udbyttenr))+VLOOKUP($CU$164,_Afg07,AZ285)*$D$93*IF($F$93<>\"\",$F$93,VLOOKUP($CU$164,_Afg07,Udbyttenr))+VLOOKUP($CU$166,_Afg07,AZ285)*$D$95*IF($F$95<>\"\",$F$95,VLOOKUP($CU$166,_Afg07,Udbyttenr))+VLOOKUP($CU$168,_Afg07,AZ285)*$D$97*IF($F$97<>\"\",$F$97,VLOOKUP($CU$168,_Afg07,Udbyttenr))+VLOOKUP($CU$170,_Afg07,AZ285)*$D$99*IF($F$99<>\"\",$F$99,VLOOKUP($CU$170,_Afg07,Udbyttenr))+VLOOKUP($CU$172,_Afg07,AZ285)*$D$101*IF($F$101<>\"\",$F$101,VLOOKUP($CU$172,_Afg07,Udbyttenr)))/($D$103*VLOOKUP($R$341,_Afg07,Udbyttenr))","v":{"$error":"#DIV/0!"}},{"$f":"(VLOOKUP($CU$160,_Afg07,BA285)*$D$89*VLOOKUP($CU$160,_Afg07,Halmnr)+VLOOKUP($CU$162,_Afg07,BA285)*$D$91*VLOOKUP($CU$162,_Afg07,Halmnr)+VLOOKUP($CU$164,_Afg07,BA285)*$D$93*VLOOKUP($CU$164,_Afg07,Halmnr)+VLOOKUP($CU$166,_Afg07,BA285)*$D$95*VLOOKUP($CU$166,_Afg07,Halmnr)+VLOOKUP($CU$168,_Afg07,BA285)*$D$97*VLOOKUP($CU$168,_Afg07,Halmnr)+VLOOKUP($CU$170,_Afg07,BA285)*$D$99*VLOOKUP($CU$170,_Afg07,Halmnr)+VLOOKUP($CU$172,_Afg07,BA285)*$D$101*VLOOKUP($CU$172,_Afg07,Halmnr))/($D$103*VLOOKUP($R$341,_Afg07,Halmnr))","v":{"$error":"#DIV/0!"}},{"$f":"(VLOOKUP($CU$160,_Afg07,BB285)*$D$89*IF($F$89<>\"\",$F$89,VLOOKUP($CU$160,_Afg07,Udbyttenr))+VLOOKUP($CU$162,_Afg07,BB285)*$D$91*IF($F$91<>\"\",$F$91,VLOOKUP($CU$162,_Afg07,Udbyttenr))+VLOOKUP($CU$164,_Afg07,BB285)*$D$93*IF($F$93<>\"\",$F$93,VLOOKUP($CU$164,_Afg07,Udbyttenr))+VLOOKUP($CU$166,_Afg07,BB285)*$D$95*IF($F$95<>\"\",$F$95,VLOOKUP($CU$166,_Afg07,Udbyttenr))+VLOOKUP($CU$168,_Afg07,BB285)*$D$97*IF($F$97<>\"\",$F$97,VLOOKUP($CU$168,_Afg07,Udbyttenr))+VLOOKUP($CU$170,_Afg07,BB285)*$D$99*IF($F$99<>\"\",$F$99,VLOOKUP($CU$170,_Afg07,Udbyttenr))+VLOOKUP($CU$172,_Afg07,BB285)*$D$101*IF($F$101<>\"\",$F$101,VLOOKUP($CU$172,_Afg07,Udbyttenr)))/($D$103*VLOOKUP($R$341,_Afg07,Udbyttenr))","v":{"$error":"#DIV/0!"}},"Sædskifte 2",{"$f":"(VLOOKUP($CU$160,_Afg07,BD285)*$D$89+VLOOKUP($CU$162,_Afg07,BD285)*$D$91+VLOOKUP($CU$164,_Afg07,BD285)*$D$93+VLOOKUP($CU$166,_Afg07,BD285)*$D$95+VLOOKUP($CU$168,_Afg07,BD285)*$D$97+VLOOKUP($CU$170,_Afg07,BD285)*$D$99+VLOOKUP($CU$172,_Afg07,BD285)*$D$101)/$D$103","v":{"$error":"#DIV/0!"}},{"$error":"#DIV/0!"},{"$error":"#DIV/0!"},{"$error":"#DIV/0!"},{"$error":"#DIV/0!"},{"$error":"#DIV/0!"},{"$error":"#DIV/0!"},{"$error":"#DIV/0!"},{"$error":"#DIV/0!"},{"$error":"#DIV/0!"},{"$f":"(IF(AND(VLOOKUP($CU$160,_Afg07,$BU$285)=1,$CX$5=4),0,VLOOKUP($CU$160,_Afg07,BN285)*$D$89*IF($F$89<>\"\",$F$89,VLOOKUP($CU$160,_Afg07,Udbyttenr)))+IF(AND(VLOOKUP($CU$162,_Afg07,$BU$285)=1,$CX$5=4),0,VLOOKUP($CU$162,_Afg07,BN285)*$D$91*IF($F$91<>\"\",$F$91,VLOOKUP($CU$162,_Afg07,Udbyttenr)))+IF(AND(VLOOKUP($CU$164,_Afg07,$BU$285)=1,$CX$5=4),0,VLOOKUP($CU$164,_Afg07,BN285)*$D$93*IF($F$93<>\"\",$F$93,VLOOKUP($CU$164,_Afg07,Udbyttenr)))+IF(AND(VLOOKUP($CU$166,_Afg07,$BU$285)=1,$CX$5=4),0,VLOOKUP($CU$166,_Afg07,BN285)*$D$95*IF($F$95<>\"\",$F$95,VLOOKUP($CU$166,_Afg07,Udbyttenr)))+IF(AND(VLOOKUP($CU$168,_Afg07,$BU$285)=1,$CX$5=4),0,VLOOKUP($CU$168,_Afg07,BN285)*$D$97*IF($F$97<>\"\",$F$97,VLOOKUP($CU$168,_Afg07,Udbyttenr)))+IF(AND(VLOOKUP($CU$170,_Afg07,$BU$285)=1,$CX$5=4),0,VLOOKUP($CU$170,_Afg07,BN285)*$D$99*IF($F$99<>\"\",$F$99,VLOOKUP($CU$170,_Afg07,Udbyttenr)))+IF(AND(VLOOKUP($CU$172,_Afg07,$BU$285)=1,$CX$5=4),0,VLOOKUP($CU$172,_Afg07,BN285)*$D$101*IF($F$101<>\"\",$F$101,VLOOKUP($CU$172,_Afg07,Udbyttenr))))/($D$103*VLOOKUP($R$341,_Afg07,Udbyttenr))","v":{"$error":"#DIV/0!"}},{"$f":"(IF(AND(VLOOKUP($CU$160,_Afg07,$BU$285)=1,$CX$5=4),0,VLOOKUP($CU$160,_Afg07,BO285)*$D$89*IF($F$89<>\"\",$F$89,VLOOKUP($CU$160,_Afg07,Udbyttenr)))+IF(AND(VLOOKUP($CU$162,_Afg07,$BU$285)=1,$CX$5=4),0,VLOOKUP($CU$162,_Afg07,BO285)*$D$91*IF($F$91<>\"\",$F$91,VLOOKUP($CU$162,_Afg07,Udbyttenr)))+IF(AND(VLOOKUP($CU$164,_Afg07,$BU$285)=1,$CX$5=4),0,VLOOKUP($CU$164,_Afg07,BO285)*$D$93*IF($F$93<>\"\",$F$93,VLOOKUP($CU$164,_Afg07,Udbyttenr)))+IF(AND(VLOOKUP($CU$166,_Afg07,$BU$285)=1,$CX$5=4),0,VLOOKUP($CU$166,_Afg07,BO285)*$D$95*IF($F$95<>\"\",$F$95,VLOOKUP($CU$166,_Afg07,Udbyttenr)))+IF(AND(VLOOKUP($CU$168,_Afg07,$BU$285)=1,$CX$5=4),0,VLOOKUP($CU$168,_Afg07,BO285)*$D$97*IF($F$97<>\"\",$F$97,VLOOKUP($CU$168,_Afg07,Udbyttenr)))+IF(AND(VLOOKUP($CU$170,_Afg07,$BU$285)=1,$CX$5=4),0,VLOOKUP($CU$170,_Afg07,BO285)*$D$99*IF($F$99<>\"\",$F$99,VLOOKUP($CU$170,_Afg07,Udbyttenr)))+IF(AND(VLOOKUP($CU$172,_Afg07,$BU$285)=1,$CX$5=4),0,VLOOKUP($CU$172,_Afg07,BO285)*$D$101*IF($F$101<>\"\",$F$101,VLOOKUP($CU$172,_Afg07,Udbyttenr))))/($D$103*VLOOKUP($R$341,_Afg07,Udbyttenr))","v":{"$error":"#DIV/0!"}},{"$f":"(IF(AND(VLOOKUP($CU$160,_Afg07,$BU$285)=1,$CX$5=4),0,VLOOKUP($CU$160,_Afg07,BP285)*$D$89*IF($F$89<>\"\",$F$89,VLOOKUP($CU$160,_Afg07,Udbyttenr)))+IF(AND(VLOOKUP($CU$162,_Afg07,$BU$285)=1,$CX$5=4),0,VLOOKUP($CU$162,_Afg07,BP285)*$D$91*IF($F$91<>\"\",$F$91,VLOOKUP($CU$162,_Afg07,Udbyttenr)))+IF(AND(VLOOKUP($CU$164,_Afg07,$BU$285)=1,$CX$5=4),0,VLOOKUP($CU$164,_Afg07,BP285)*$D$93*IF($F$93<>\"\",$F$93,VLOOKUP($CU$164,_Afg07,Udbyttenr)))+IF(AND(VLOOKUP($CU$166,_Afg07,$BU$285)=1,$CX$5=4),0,VLOOKUP($CU$166,_Afg07,BP285)*$D$95*IF($F$95<>\"\",$F$95,VLOOKUP($CU$166,_Afg07,Udbyttenr)))+IF(AND(VLOOKUP($CU$168,_Afg07,$BU$285)=1,$CX$5=4),0,VLOOKUP($CU$168,_Afg07,BP285)*$D$97*IF($F$97<>\"\",$F$97,VLOOKUP($CU$168,_Afg07,Udbyttenr)))+IF(AND(VLOOKUP($CU$170,_Afg07,$BU$285)=1,$CX$5=4),0,VLOOKUP($CU$170,_Afg07,BP285)*$D$99*IF($F$99<>\"\",$F$99,VLOOKUP($CU$170,_Afg07,Udbyttenr)))+IF(AND(VLOOKUP($CU$172,_Afg07,$BU$285)=1,$CX$5=4),0,VLOOKUP($CU$172,_Afg07,BP285)*$D$101*IF($F$101<>\"\",$F$101,VLOOKUP($CU$172,_Afg07,Udbyttenr))))/($D$103*VLOOKUP($R$341,_Afg07,Udbyttenr))","v":{"$error":"#DIV/0!"}},{"$f":"(IF(VLOOKUP($CU$160,_Afg07,$BU$285)=1,VLOOKUP($CU$160,_Afg07,BQ285)*$D$89*IF($F$89<>\"\",$F$89,VLOOKUP($CU$160,_Afg07,Udbyttenr)),0)+IF(VLOOKUP($CU$162,_Afg07,$BU$285)=1,VLOOKUP($CU$162,_Afg07,BQ285)*$D$91*IF($F$91<>\"\",$F$91,VLOOKUP($CU$162,_Afg07,Udbyttenr)),0)+IF(VLOOKUP($CU$164,_Afg07,$BU$285)=1,VLOOKUP($CU$164,_Afg07,BQ285)*$D$93*IF($F$93<>\"\",$F$93,VLOOKUP($CU$164,_Afg07,Udbyttenr)),0)+IF(VLOOKUP($CU$166,_Afg07,$BU$285)=1,VLOOKUP($CU$166,_Afg07,BQ285)*$D$95*IF($F$95<>\"\",$F$95,VLOOKUP($CU$166,_Afg07,Udbyttenr)),0)+IF(VLOOKUP($CU$168,_Afg07,$BU$285)=1,VLOOKUP($CU$168,_Afg07,BQ285)*$D$97*IF($F$97<>\"\",$F$97,VLOOKUP($CU$168,_Afg07,Udbyttenr)),0)+IF(VLOOKUP($CU$170,_Afg07,$BU$285)=1,VLOOKUP($CU$170,_Afg07,BQ285)*$D$99*IF($F$99<>\"\",$F$99,VLOOKUP($CU$170,_Afg07,Udbyttenr)),0)+IF(VLOOKUP($CU$172,_Afg07,$BU$285)=1,VLOOKUP($CU$172,_Afg07,BQ285)*$D$101*IF($F$101<>\"\",$F$101,VLOOKUP($CU$172,_Afg07,Udbyttenr)),0))/($CX$174)","v":{"$error":"#DIV/0!"}},{"$f":"(IF(VLOOKUP($CU$160,_Afg07,$BU$285)=1,VLOOKUP($CU$160,_Afg07,BR285)*$D$89*IF($F$89<>\"\",$F$89,VLOOKUP($CU$160,_Afg07,Udbyttenr)),0)+IF(VLOOKUP($CU$162,_Afg07,$BU$285)=1,VLOOKUP($CU$162,_Afg07,BR285)*$D$91*IF($F$91<>\"\",$F$91,VLOOKUP($CU$162,_Afg07,Udbyttenr)),0)+IF(VLOOKUP($CU$164,_Afg07,$BU$285)=1,VLOOKUP($CU$164,_Afg07,BR285)*$D$93*IF($F$93<>\"\",$F$93,VLOOKUP($CU$164,_Afg07,Udbyttenr)),0)+IF(VLOOKUP($CU$166,_Afg07,$BU$285)=1,VLOOKUP($CU$166,_Afg07,BR285)*$D$95*IF($F$95<>\"\",$F$95,VLOOKUP($CU$166,_Afg07,Udbyttenr)),0)+IF(VLOOKUP($CU$168,_Afg07,$BU$285)=1,VLOOKUP($CU$168,_Afg07,BR285)*$D$97*IF($F$97<>\"\",$F$97,VLOOKUP($CU$168,_Afg07,Udbyttenr)),0)+IF(VLOOKUP($CU$170,_Afg07,$BU$285)=1,VLOOKUP($CU$170,_Afg07,BR285)*$D$99*IF($F$99<>\"\",$F$99,VLOOKUP($CU$170,_Afg07,Udbyttenr)),0)+IF(VLOOKUP($CU$172,_Afg07,$BU$285)=1,VLOOKUP($CU$172,_Afg07,BR285)*$D$101*IF($F$101<>\"\",$F$101,VLOOKUP($CU$172,_Afg07,Udbyttenr)),0))/($CX$174)","v":{"$error":"#DIV/0!"}},{"$f":"(IF(VLOOKUP($CU$160,_Afg07,$BU$285)=1,VLOOKUP($CU$160,_Afg07,BS285)*$D$89*IF($F$89<>\"\",$F$89,VLOOKUP($CU$160,_Afg07,Udbyttenr)),0)+IF(VLOOKUP($CU$162,_Afg07,$BU$285)=1,VLOOKUP($CU$162,_Afg07,BS285)*$D$91*IF($F$91<>\"\",$F$91,VLOOKUP($CU$162,_Afg07,Udbyttenr)),0)+IF(VLOOKUP($CU$164,_Afg07,$BU$285)=1,VLOOKUP($CU$164,_Afg07,BS285)*$D$93*IF($F$93<>\"\",$F$93,VLOOKUP($CU$164,_Afg07,Udbyttenr)),0)+IF(VLOOKUP($CU$166,_Afg07,$BU$285)=1,VLOOKUP($CU$166,_Afg07,BS285)*$D$95*IF($F$95<>\"\",$F$95,VLOOKUP($CU$166,_Afg07,Udbyttenr)),0)+IF(VLOOKUP($CU$168,_Afg07,$BU$285)=1,VLOOKUP($CU$168,_Afg07,BS285)*$D$97*IF($F$97<>\"\",$F$97,VLOOKUP($CU$168,_Afg07,Udbyttenr)),0)+IF(VLOOKUP($CU$170,_Afg07,$BU$285)=1,VLOOKUP($CU$170,_Afg07,BS285)*$D$99*IF($F$99<>\"\",$F$99,VLOOKUP($CU$170,_Afg07,Udbyttenr)),0)+IF(VLOOKUP($CU$172,_Afg07,$BU$285)=1,VLOOKUP($CU$172,_Afg07,BS285)*$D$101*IF($F$101<>\"\",$F$101,VLOOKUP($CU$172,_Afg07,Udbyttenr)),0))/($CX$174)","v":{"$error":"#DIV/0!"}},{"$f":"(IF(VLOOKUP($CU$160,_Afg07,$BU$285)=1,VLOOKUP($CU$160,_Afg07,BT285)*$D$89*IF($F$89<>\"\",$F$89,VLOOKUP($CU$160,_Afg07,Udbyttenr)),0)+IF(VLOOKUP($CU$162,_Afg07,$BU$285)=1,VLOOKUP($CU$162,_Afg07,BT285)*$D$91*IF($F$91<>\"\",$F$91,VLOOKUP($CU$162,_Afg07,Udbyttenr)),0)+IF(VLOOKUP($CU$164,_Afg07,$BU$285)=1,VLOOKUP($CU$164,_Afg07,BT285)*$D$93*IF($F$93<>\"\",$F$93,VLOOKUP($CU$164,_Afg07,Udbyttenr)),0)+IF(VLOOKUP($CU$166,_Afg07,$BU$285)=1,VLOOKUP($CU$166,_Afg07,BT285)*$D$95*IF($F$95<>\"\",$F$95,VLOOKUP($CU$166,_Afg07,Udbyttenr)),0)+IF(VLOOKUP($CU$168,_Afg07,$BU$285)=1,VLOOKUP($CU$168,_Afg07,BT285)*$D$97*IF($F$97<>\"\",$F$97,VLOOKUP($CU$168,_Afg07,Udbyttenr)),0)+IF(VLOOKUP($CU$170,_Afg07,$BU$285)=1,VLOOKUP($CU$170,_Afg07,BT285)*$D$99*IF($F$99<>\"\",$F$99,VLOOKUP($CU$170,_Afg07,Udbyttenr)),0)+IF(VLOOKUP($CU$172,_Afg07,$BU$285)=1,VLOOKUP($CU$172,_Afg07,BT285)*$D$101*IF($F$101<>\"\",$F$101,VLOOKUP($CU$172,_Afg07,Udbyttenr)),0))/($CX$174)","v":{"$error":"#DIV/0!"}},4,null,null,null,null,null,null,null,null,null,null,null,null,null,null,null,null,"Sædskifte 2"]
[]
[null,null,null,null,null,null,null,null,null,null,null,null,null,null,null,null,null,null,null,null,"Udbytte","Hektar",null,null,null,null,"Hektar",null,null,null,null,"Hektar",null,null,null,null,"Hektar","Hektar","Hektar","Hektar",null,"Hektar",null,null,null,null,"Hektar","Hektar","Udbytte","Halm","Hektar","Udbytte","Halm","Udbytte",null,"Hektarrelateret",null,null,null,null,"Hektar",null,null,null,null,"Udbytte","Udbytte",null,"Udbytterelateret, men skal kun regnes for korn"]
[null,null,null,null,null,null,null,null,null,null,null,null,null,null,null,null,null,1,2,3,4,5,6,7,8,9,10,11,12,13,14,15,16,17,18,19,20,21,22,23,24,25,26,27,28,29,30,31,32,33,34,35,36,37,38,39,40,41,42,43,44,45,46,47,48,49,50,51,52,53,54,55,56,null,null,null,null,null,null,null,null,null,null,null,null,null,null,null,null,57]
[null,null,null,null,null,null,null,null,null,null,null,null,null,null,null,null,null,1,null,null,null,null,null,null,null,null,{"$f":"(IF(VLOOKUP($CU$159,_Afg07,$BU$285)=1,VLOOKUP($CU$159,_Afg07,AA285)*$D$68,0)+IF(VLOOKUP($CU$161,_Afg07,$BU$285)=1,VLOOKUP($CU$161,_Afg07,AA285)*$D$70,0)+IF(VLOOKUP($CU$163,_Afg07,$BU$285)=1,VLOOKUP($CU$163,_Afg07,AA285)*$D$72,0)+IF(VLOOKUP($CU$165,_Afg07,$BU$285)=1,VLOOKUP($CU$165,_Afg07,AA285)*$D$74,0)+IF(VLOOKUP($CU$167,_Afg07,$BU$285)=1,VLOOKUP($CU$167,_Afg07,AA285)*$D$76,0)+IF(VLOOKUP($CU$169,_Afg07,$BU$285)=1,VLOOKUP($CU$169,_Afg07,AA285)*$D$78,0)+IF(VLOOKUP($CU$171,_Afg07,$BU$285)=1,VLOOKUP($CU$171,_Afg07,AA285)*$D$80,0))/($CY$173)","v":{"$error":"#DIV/0!"}},{"$f":"(IF(VLOOKUP($CU$159,_Afg07,$BU$285)=1,VLOOKUP($CU$159,_Afg07,AB285)*$D$68,0)+IF(VLOOKUP($CU$161,_Afg07,$BU$285)=1,VLOOKUP($CU$161,_Afg07,AB285)*$D$70,0)+IF(VLOOKUP($CU$163,_Afg07,$BU$285)=1,VLOOKUP($CU$163,_Afg07,AB285)*$D$72,0)+IF(VLOOKUP($CU$165,_Afg07,$BU$285)=1,VLOOKUP($CU$165,_Afg07,AB285)*$D$74,0)+IF(VLOOKUP($CU$167,_Afg07,$BU$285)=1,VLOOKUP($CU$167,_Afg07,AB285)*$D$76,0)+IF(VLOOKUP($CU$169,_Afg07,$BU$285)=1,VLOOKUP($CU$169,_Afg07,AB285)*$D$78,0)+IF(VLOOKUP($CU$171,_Afg07,$BU$285)=1,VLOOKUP($CU$171,_Afg07,AB285)*$D$80,0))/($CY$173)","v":{"$error":"#DIV/0!"}},{"$f":"(IF(VLOOKUP($CU$159,_Afg07,$BU$285)=1,VLOOKUP($CU$159,_Afg07,AC285)*$D$68,0)+IF(VLOOKUP($CU$161,_Afg07,$BU$285)=1,VLOOKUP($CU$161,_Afg07,AC285)*$D$70,0)+IF(VLOOKUP($CU$163,_Afg07,$BU$285)=1,VLOOKUP($CU$163,_Afg07,AC285)*$D$72,0)+IF(VLOOKUP($CU$165,_Afg07,$BU$285)=1,VLOOKUP($CU$165,_Afg07,AC285)*$D$74,0)+IF(VLOOKUP($CU$167,_Afg07,$BU$285)=1,VLOOKUP($CU$167,_Afg07,AC285)*$D$76,0)+IF(VLOOKUP($CU$169,_Afg07,$BU$285)=1,VLOOKUP($CU$169,_Afg07,AC285)*$D$78,0)+IF(VLOOKUP($CU$171,_Afg07,$BU$285)=1,VLOOKUP($CU$171,_Afg07,AC285)*$D$80,0))/($CY$173)","v":{"$error":"#DIV/0!"}},{"$f":"(IF(VLOOKUP($CU$159,_Afg07,$BU$285)=1,VLOOKUP($CU$159,_Afg07,AD285)*$D$68,0)+IF(VLOOKUP($CU$161,_Afg07,$BU$285)=1,VLOOKUP($CU$161,_Afg07,AD285)*$D$70,0)+IF(VLOOKUP($CU$163,_Afg07,$BU$285)=1,VLOOKUP($CU$163,_Afg07,AD285)*$D$72,0)+IF(VLOOKUP($CU$165,_Afg07,$BU$285)=1,VLOOKUP($CU$165,_Afg07,AD285)*$D$74,0)+IF(VLOOKUP($CU$167,_Afg07,$BU$285)=1,VLOOKUP($CU$167,_Afg07,AD285)*$D$76,0)+IF(VLOOKUP($CU$169,_Afg07,$BU$285)=1,VLOOKUP($CU$169,_Afg07,AD285)*$D$78,0)+IF(VLOOKUP($CU$171,_Afg07,$BU$285)=1,VLOOKUP($CU$171,_Afg07,AD285)*$D$80,0))/($CY$173)","v":{"$error":"#DIV/0!"}},{"$f":"(IF(VLOOKUP($CU$159,_Afg07,$BU$285)=1,VLOOKUP($CU$159,_Afg07,AE285)*$D$68,0)+IF(VLOOKUP($CU$161,_Afg07,$BU$285)=1,VLOOKUP($CU$161,_Afg07,AE285)*$D$70,0)+IF(VLOOKUP($CU$163,_Afg07,$BU$285)=1,VLOOKUP($CU$163,_Afg07,AE285)*$D$72,0)+IF(VLOOKUP($CU$165,_Afg07,$BU$285)=1,VLOOKUP($CU$165,_Afg07,AE285)*$D$74,0)+IF(VLOOKUP($CU$167,_Afg07,$BU$285)=1,VLOOKUP($CU$167,_Afg07,AE285)*$D$76,0)+IF(VLOOKUP($CU$169,_Afg07,$BU$285)=1,VLOOKUP($CU$169,_Afg07,AE285)*$D$78,0)+IF(VLOOKUP($CU$171,_Afg07,$BU$285)=1,VLOOKUP($CU$171,_Afg07,AE285)*$D$80,0))/($CY$173)","v":{"$error":"#DIV/0!"}},null,null,null,null,null,null,{"$f":"(IF(VLOOKUP($CU$159,_Afg07,$BU$285)=1,VLOOKUP($CU$159,_Afg07,AL285)*$D$68,0)+IF(VLOOKUP($CU$161,_Afg07,$BU$285)=1,VLOOKUP($CU$161,_Afg07,AL285)*$D$70,0)+IF(VLOOKUP($CU$163,_Afg07,$BU$285)=1,VLOOKUP($CU$163,_Afg07,AL285)*$D$72,0)+IF(VLOOKUP($CU$165,_Afg07,$BU$285)=1,VLOOKUP($CU$165,_Afg07,AL285)*$D$74,0)+IF(VLOOKUP($CU$167,_Afg07,$BU$285)=1,VLOOKUP($CU$167,_Afg07,AL285)*$D$76,0)+IF(VLOOKUP($CU$169,_Afg07,$BU$285)=1,VLOOKUP($CU$169,_Afg07,AL285)*$D$78,0)+IF(VLOOKUP($CU$171,_Afg07,$BU$285)=1,VLOOKUP($CU$171,_Afg07,AL285)*$D$80,0))/($CY$173)","v":{"$error":"#DIV/0!"}},{"$f":"(IF(VLOOKUP($CU$159,_Afg07,$BU$285)=1,VLOOKUP($CU$159,_Afg07,AM285)*$D$68,0)+IF(VLOOKUP($CU$161,_Afg07,$BU$285)=1,VLOOKUP($CU$161,_Afg07,AM285)*$D$70,0)+IF(VLOOKUP($CU$163,_Afg07,$BU$285)=1,VLOOKUP($CU$163,_Afg07,AM285)*$D$72,0)+IF(VLOOKUP($CU$165,_Afg07,$BU$285)=1,VLOOKUP($CU$165,_Afg07,AM285)*$D$74,0)+IF(VLOOKUP($CU$167,_Afg07,$BU$285)=1,VLOOKUP($CU$167,_Afg07,AM285)*$D$76,0)+IF(VLOOKUP($CU$169,_Afg07,$BU$285)=1,VLOOKUP($CU$169,_Afg07,AM285)*$D$78,0)+IF(VLOOKUP($CU$171,_Afg07,$BU$285)=1,VLOOKUP($CU$171,_Afg07,AM285)*$D$80,0))/($CY$173)","v":{"$error":"#DIV/0!"}},{"$f":"(IF(VLOOKUP($CU$159,_Afg07,$BU$285)=1,VLOOKUP($CU$159,_Afg07,AN285)*$D$68,0)+IF(VLOOKUP($CU$161,_Afg07,$BU$285)=1,VLOOKUP($CU$161,_Afg07,AN285)*$D$70,0)+IF(VLOOKUP($CU$163,_Afg07,$BU$285)=1,VLOOKUP($CU$163,_Afg07,AN285)*$D$72,0)+IF(VLOOKUP($CU$165,_Afg07,$BU$285)=1,VLOOKUP($CU$165,_Afg07,AN285)*$D$74,0)+IF(VLOOKUP($CU$167,_Afg07,$BU$285)=1,VLOOKUP($CU$167,_Afg07,AN285)*$D$76,0)+IF(VLOOKUP($CU$169,_Afg07,$BU$285)=1,VLOOKUP($CU$169,_Afg07,AN285)*$D$78,0)+IF(VLOOKUP($CU$171,_Afg07,$BU$285)=1,VLOOKUP($CU$171,_Afg07,AN285)*$D$80,0))/($CY$173)","v":{"$error":"#DIV/0!"}},null,{"$f":"(IF(VLOOKUP($CU$159,_Afg07,$BU$285)=1,VLOOKUP($CU$159,_Afg07,AP285)*$D$68,0)+IF(VLOOKUP($CU$161,_Afg07,$BU$285)=1,VLOOKUP($CU$161,_Afg07,AP285)*$D$70,0)+IF(VLOOKUP($CU$163,_Afg07,$BU$285)=1,VLOOKUP($CU$163,_Afg07,AP285)*$D$72,0)+IF(VLOOKUP($CU$165,_Afg07,$BU$285)=1,VLOOKUP($CU$165,_Afg07,AP285)*$D$74,0)+IF(VLOOKUP($CU$167,_Afg07,$BU$285)=1,VLOOKUP($CU$167,_Afg07,AP285)*$D$76,0)+IF(VLOOKUP($CU$169,_Afg07,$BU$285)=1,VLOOKUP($CU$169,_Afg07,AP285)*$D$78,0)+IF(VLOOKUP($CU$171,_Afg07,$BU$285)=1,VLOOKUP($CU$171,_Afg07,AP285)*$D$80,0))/($CY$173)","v":{"$error":"#DIV/0!"}},{"$error":"#DIV/0!"},{"$error":"#DIV/0!"},{"$error":"#DIV/0!"},{"$error":"#DIV/0!"},{"$error":"#DIV/0!"},{"$error":"#DIV/0!"},{"$f":"(IF(VLOOKUP($CU$159,_Afg07,$BU$285)=1,VLOOKUP($CU$159,_Afg07,AW285)*$D$68*IF($F$68<>\"\",$F$68,VLOOKUP($CU$159,_Afg07,Udbyttenr)),0)+IF(VLOOKUP($CU$161,_Afg07,$BU$285)=1,VLOOKUP($CU$161,_Afg07,AW285)*$D$70*IF($F$70<>\"\",$F$70,VLOOKUP($CU$161,_Afg07,Udbyttenr)),0)+IF(VLOOKUP($CU$163,_Afg07,$BU$285)=1,VLOOKUP($CU$163,_Afg07,AW285)*$D$72*IF($F$72<>\"\",$F$72,VLOOKUP($CU$163,_Afg07,Udbyttenr)),0)+IF(VLOOKUP($CU$165,_Afg07,$BU$285)=1,VLOOKUP($CU$165,_Afg07,AW285)*$D$74*IF($F$74<>\"\",$F$74,VLOOKUP($CU$165,_Afg07,Udbyttenr)),0)+IF(VLOOKUP($CU$167,_Afg07,$BU$285)=1,VLOOKUP($CU$167,_Afg07,AW285)*$D$76*IF($F$76<>\"\",$F$76,VLOOKUP($CU$167,_Afg07,Udbyttenr)),0)+IF(VLOOKUP($CU$169,_Afg07,$BU$285)=1,VLOOKUP($CU$169,_Afg07,AW285)*$D$78*IF($F$78<>\"\",$F$78,VLOOKUP($CU$169,_Afg07,Udbyttenr)),0)+IF(VLOOKUP($CU$171,_Afg07,$BU$285)=1,VLOOKUP($CU$171,_Afg07,AW285)*$D$80*IF($F$80<>\"\",$F$80,VLOOKUP($CU$171,_Afg07,Udbyttenr)),0))/($CX$173)","v":{"$error":"#DIV/0!"}},{"$f":"(IF(VLOOKUP($CU$159,_Afg07,$BU$285)=1,VLOOKUP($CU$159,_Afg07,AX285)*$D$68*VLOOKUP($CU$159,_Afg07,Halmnr),0)+IF(VLOOKUP($CU$161,_Afg07,$BU$285)=1,VLOOKUP($CU$161,_Afg07,AX285)*$D$70*VLOOKUP($CU$161,_Afg07,Halmnr),0)+IF(VLOOKUP($CU$163,_Afg07,$BU$285)=1,VLOOKUP($CU$163,_Afg07,AX285)*$D$72*VLOOKUP($CU$163,_Afg07,Halmnr),0)+IF(VLOOKUP($CU$165,_Afg07,$BU$285)=1,VLOOKUP($CU$165,_Afg07,AX285)*$D$74*VLOOKUP($CU$165,_Afg07,Halmnr),0)+IF(VLOOKUP($CU$167,_Afg07,$BU$285)=1,VLOOKUP($CU$167,_Afg07,AX285)*$D$76*VLOOKUP($CU$167,_Afg07,Halmnr),0)+IF(VLOOKUP($CU$169,_Afg07,$BU$285)=1,VLOOKUP($CU$169,_Afg07,AX285)*$D$78*VLOOKUP($CU$169,_Afg07,Halmnr),0)+IF(VLOOKUP($CU$171,_Afg07,$BU$285)=1,VLOOKUP($CU$171,_Afg07,AX285)*$D$80*VLOOKUP($CU$171,_Afg07,Halmnr),0))/($DB$173)","v":{"$error":"#DIV/0!"}},{"$f":"(IF(VLOOKUP($CU$159,_Afg07,$BU$285)=1,VLOOKUP($CU$159,_Afg07,AY285)*$D$68,0)+IF(VLOOKUP($CU$161,_Afg07,$BU$285)=1,VLOOKUP($CU$161,_Afg07,AY285)*$D$70,0)+IF(VLOOKUP($CU$163,_Afg07,$BU$285)=1,VLOOKUP($CU$163,_Afg07,AY285)*$D$72,0)+IF(VLOOKUP($CU$165,_Afg07,$BU$285)=1,VLOOKUP($CU$165,_Afg07,AY285)*$D$74,0)+IF(VLOOKUP($CU$167,_Afg07,$BU$285)=1,VLOOKUP($CU$167,_Afg07,AY285)*$D$76,0)+IF(VLOOKUP($CU$169,_Afg07,$BU$285)=1,VLOOKUP($CU$169,_Afg07,AY285)*$D$78,0)+IF(VLOOKUP($CU$171,_Afg07,$BU$285)=1,VLOOKUP($CU$171,_Afg07,AY285)*$D$80,0))/($CY$173)","v":{"$error":"#DIV/0!"}},{"$f":"(IF(VLOOKUP($CU$159,_Afg07,$BU$285)=1,VLOOKUP($CU$159,_Afg07,AZ285)*$D$68*IF($F$68<>\"\",$F$68,VLOOKUP($CU$159,_Afg07,Udbyttenr)),0)+IF(VLOOKUP($CU$161,_Afg07,$BU$285)=1,VLOOKUP($CU$161,_Afg07,AZ285)*$D$70*IF($F$70<>\"\",$F$70,VLOOKUP($CU$161,_Afg07,Udbyttenr)),0)+IF(VLOOKUP($CU$163,_Afg07,$BU$285)=1,VLOOKUP($CU$163,_Afg07,AZ285)*$D$72*IF($F$72<>\"\",$F$72,VLOOKUP($CU$163,_Afg07,Udbyttenr)),0)+IF(VLOOKUP($CU$165,_Afg07,$BU$285)=1,VLOOKUP($CU$165,_Afg07,AZ285)*$D$74*IF($F$74<>\"\",$F$74,VLOOKUP($CU$165,_Afg07,Udbyttenr)),0)+IF(VLOOKUP($CU$167,_Afg07,$BU$285)=1,VLOOKUP($CU$167,_Afg07,AZ285)*$D$76*IF($F$76<>\"\",$F$76,VLOOKUP($CU$167,_Afg07,Udbyttenr)),0)+IF(VLOOKUP($CU$169,_Afg07,$BU$285)=1,VLOOKUP($CU$169,_Afg07,AZ285)*$D$78*IF($F$78<>\"\",$F$78,VLOOKUP($CU$169,_Afg07,Udbyttenr)),0)+IF(VLOOKUP($CU$171,_Afg07,$BU$285)=1,VLOOKUP($CU$171,_Afg07,AZ285)*$D$80*IF($F$80<>\"\",$F$80,VLOOKUP($CU$171,_Afg07,Udbyttenr)),0))/($CX$173)","v":{"$error":"#DIV/0!"}},{"$f":"(IF(VLOOKUP($CU$159,_Afg07,$BU$285)=1,VLOOKUP($CU$159,_Afg07,BA285)*$D$68*VLOOKUP($CU$159,_Afg07,Halmnr),0)+IF(VLOOKUP($CU$161,_Afg07,$BU$285)=1,VLOOKUP($CU$161,_Afg07,BA285)*$D$70*VLOOKUP($CU$161,_Afg07,Halmnr),0)+IF(VLOOKUP($CU$163,_Afg07,$BU$285)=1,VLOOKUP($CU$163,_Afg07,BA285)*$D$72*VLOOKUP($CU$163,_Afg07,Halmnr),0)+IF(VLOOKUP($CU$165,_Afg07,$BU$285)=1,VLOOKUP($CU$165,_Afg07,BA285)*$D$74*VLOOKUP($CU$165,_Afg07,Halmnr),0)+IF(VLOOKUP($CU$167,_Afg07,$BU$285)=1,VLOOKUP($CU$167,_Afg07,BA285)*$D$76*VLOOKUP($CU$167,_Afg07,Halmnr),0)+IF(VLOOKUP($CU$169,_Afg07,$BU$285)=1,VLOOKUP($CU$169,_Afg07,BA285)*$D$78*VLOOKUP($CU$169,_Afg07,Halmnr),0)+IF(VLOOKUP($CU$171,_Afg07,$BU$285)=1,VLOOKUP($CU$171,_Afg07,BA285)*$D$80*VLOOKUP($CU$171,_Afg07,Halmnr),0))/($DB$173)","v":{"$error":"#DIV/0!"}},{"$f":"(IF(VLOOKUP($CU$159,_Afg07,$BU$285)=1,VLOOKUP($CU$159,_Afg07,BB285)*$D$68*IF($F$68<>\"\",$F$68,VLOOKUP($CU$159,_Afg07,Udbyttenr)),0)+IF(VLOOKUP($CU$161,_Afg07,$BU$285)=1,VLOOKUP($CU$161,_Afg07,BB285)*$D$70*IF($F$70<>\"\",$F$70,VLOOKUP($CU$161,_Afg07,Udbyttenr)),0)+IF(VLOOKUP($CU$163,_Afg07,$BU$285)=1,VLOOKUP($CU$163,_Afg07,BB285)*$D$72*IF($F$72<>\"\",$F$72,VLOOKUP($CU$163,_Afg07,Udbyttenr)),0)+IF(VLOOKUP($CU$165,_Afg07,$BU$285)=1,VLOOKUP($CU$165,_Afg07,BB285)*$D$74*IF($F$74<>\"\",$F$74,VLOOKUP($CU$165,_Afg07,Udbyttenr)),0)+IF(VLOOKUP($CU$167,_Afg07,$BU$285)=1,VLOOKUP($CU$167,_Afg07,BB285)*$D$76*IF($F$76<>\"\",$F$76,VLOOKUP($CU$167,_Afg07,Udbyttenr)),0)+IF(VLOOKUP($CU$169,_Afg07,$BU$285)=1,VLOOKUP($CU$169,_Afg07,BB285)*$D$78*IF($F$78<>\"\",$F$78,VLOOKUP($CU$169,_Afg07,Udbyttenr)),0)+IF(VLOOKUP($CU$171,_Afg07,$BU$285)=1,VLOOKUP($CU$171,_Afg07,BB285)*$D$80*IF($F$80<>\"\",$F$80,VLOOKUP($CU$171,_Afg07,Udbyttenr)),0))/($CX$173)","v":{"$error":"#DIV/0!"}},null,{"$f":"(IF(VLOOKUP($CU$159,_Afg07,$BU$285)=1,VLOOKUP($CU$159,_Afg07,BD285)*$D$68,0)+IF(VLOOKUP($CU$161,_Afg07,$BU$285)=1,VLOOKUP($CU$161,_Afg07,BD285)*$D$70,0)+IF(VLOOKUP($CU$163,_Afg07,$BU$285)=1,VLOOKUP($CU$163,_Afg07,BD285)*$D$72,0)+IF(VLOOKUP($CU$165,_Afg07,$BU$285)=1,VLOOKUP($CU$165,_Afg07,BD285)*$D$74,0)+IF(VLOOKUP($CU$167,_Afg07,$BU$285)=1,VLOOKUP($CU$167,_Afg07,BD285)*$D$76,0)+IF(VLOOKUP($CU$169,_Afg07,$BU$285)=1,VLOOKUP($CU$169,_Afg07,BD285)*$D$78,0)+IF(VLOOKUP($CU$171,_Afg07,$BU$285)=1,VLOOKUP($CU$171,_Afg07,BD285)*$D$80,0))/($CY$173)","v":{"$error":"#DIV/0!"}},{"$error":"#DIV/0!"},{"$error":"#DIV/0!"},{"$error":"#DIV/0!"},{"$error":"#DIV/0!"},{"$error":"#DIV/0!"},{"$error":"#DIV/0!"},{"$error":"#DIV/0!"},{"$error":"#DIV/0!"},{"$error":"#DIV/0!"},{"$f":"(IF(VLOOKUP($CU$159,_Afg07,$BU$285)=1,VLOOKUP($CU$159,_Afg07,BN285)*$D$68*IF($F$68<>\"\",$F$68,VLOOKUP($CU$159,_Afg07,Udbyttenr)),0)+IF(VLOOKUP($CU$161,_Afg07,$BU$285)=1,VLOOKUP($CU$161,_Afg07,BN285)*$D$70*IF($F$70<>\"\",$F$70,VLOOKUP($CU$161,_Afg07,Udbyttenr)),0)+IF(VLOOKUP($CU$163,_Afg07,$BU$285)=1,VLOOKUP($CU$163,_Afg07,BN285)*$D$72*IF($F$72<>\"\",$F$72,VLOOKUP($CU$163,_Afg07,Udbyttenr)),0)+IF(VLOOKUP($CU$165,_Afg07,$BU$285)=1,VLOOKUP($CU$165,_Afg07,BN285)*$D$74*IF($F$74<>\"\",$F$74,VLOOKUP($CU$165,_Afg07,Udbyttenr)),0)+IF(VLOOKUP($CU$167,_Afg07,$BU$285)=1,VLOOKUP($CU$167,_Afg07,BN285)*$D$76*IF($F$76<>\"\",$F$76,VLOOKUP($CU$167,_Afg07,Udbyttenr)),0)+IF(VLOOKUP($CU$169,_Afg07,$BU$285)=1,VLOOKUP($CU$169,_Afg07,BN285)*$D$78*IF($F$78<>\"\",$F$78,VLOOKUP($CU$169,_Afg07,Udbyttenr)),0)+IF(VLOOKUP($CU$171,_Afg07,$BU$285)=1,VLOOKUP($CU$171,_Afg07,BN285)*$D$80*IF($F$80<>\"\",$F$80,VLOOKUP($CU$171,_Afg07,Udbyttenr)),0))/($CX$173)","v":{"$error":"#DIV/0!"}},{"$f":"(IF(VLOOKUP($CU$159,_Afg07,$BU$285)=1,VLOOKUP($CU$159,_Afg07,BO285)*$D$68*IF($F$68<>\"\",$F$68,VLOOKUP($CU$159,_Afg07,Udbyttenr)),0)+IF(VLOOKUP($CU$161,_Afg07,$BU$285)=1,VLOOKUP($CU$161,_Afg07,BO285)*$D$70*IF($F$70<>\"\",$F$70,VLOOKUP($CU$161,_Afg07,Udbyttenr)),0)+IF(VLOOKUP($CU$163,_Afg07,$BU$285)=1,VLOOKUP($CU$163,_Afg07,BO285)*$D$72*IF($F$72<>\"\",$F$72,VLOOKUP($CU$163,_Afg07,Udbyttenr)),0)+IF(VLOOKUP($CU$165,_Afg07,$BU$285)=1,VLOOKUP($CU$165,_Afg07,BO285)*$D$74*IF($F$74<>\"\",$F$74,VLOOKUP($CU$165,_Afg07,Udbyttenr)),0)+IF(VLOOKUP($CU$167,_Afg07,$BU$285)=1,VLOOKUP($CU$167,_Afg07,BO285)*$D$76*IF($F$76<>\"\",$F$76,VLOOKUP($CU$167,_Afg07,Udbyttenr)),0)+IF(VLOOKUP($CU$169,_Afg07,$BU$285)=1,VLOOKUP($CU$169,_Afg07,BO285)*$D$78*IF($F$78<>\"\",$F$78,VLOOKUP($CU$169,_Afg07,Udbyttenr)),0)+IF(VLOOKUP($CU$171,_Afg07,$BU$285)=1,VLOOKUP($CU$171,_Afg07,BO285)*$D$80*IF($F$80<>\"\",$F$80,VLOOKUP($CU$171,_Afg07,Udbyttenr)),0))/($CX$173)","v":{"$error":"#DIV/0!"}},null,{"$f":"(IF(VLOOKUP($CU$159,_Afg07,$BU$285)=1,VLOOKUP($CU$159,_Afg07,BQ285)*$D$68*IF($F$68<>\"\",$F$68,VLOOKUP($CU$159,_Afg07,Udbyttenr)),0)+IF(VLOOKUP($CU$161,_Afg07,$BU$285)=1,VLOOKUP($CU$161,_Afg07,BQ285)*$D$70*IF($F$70<>\"\",$F$70,VLOOKUP($CU$161,_Afg07,Udbyttenr)),0)+IF(VLOOKUP($CU$163,_Afg07,$BU$285)=1,VLOOKUP($CU$163,_Afg07,BQ285)*$D$72*IF($F$72<>\"\",$F$72,VLOOKUP($CU$163,_Afg07,Udbyttenr)),0)+IF(VLOOKUP($CU$165,_Afg07,$BU$285)=1,VLOOKUP($CU$165,_Afg07,BQ285)*$D$74*IF($F$74<>\"\",$F$74,VLOOKUP($CU$165,_Afg07,Udbyttenr)),0)+IF(VLOOKUP($CU$167,_Afg07,$BU$285)=1,VLOOKUP($CU$167,_Afg07,BQ285)*$D$76*IF($F$76<>\"\",$F$76,VLOOKUP($CU$167,_Afg07,Udbyttenr)),0)+IF(VLOOKUP($CU$169,_Afg07,$BU$285)=1,VLOOKUP($CU$169,_Afg07,BQ285)*$D$78*IF($F$78<>\"\",$F$78,VLOOKUP($CU$169,_Afg07,Udbyttenr)),0)+IF(VLOOKUP($CU$171,_Afg07,$BU$285)=1,VLOOKUP($CU$171,_Afg07,BQ285)*$D$80*IF($F$80<>\"\",$F$80,VLOOKUP($CU$171,_Afg07,Udbyttenr)),0))/($CX$173)","v":{"$error":"#DIV/0!"}},{"$f":"(IF(VLOOKUP($CU$159,_Afg07,$BU$285)=1,VLOOKUP($CU$159,_Afg07,BR285)*$D$68*IF($F$68<>\"\",$F$68,VLOOKUP($CU$159,_Afg07,Udbyttenr)),0)+IF(VLOOKUP($CU$161,_Afg07,$BU$285)=1,VLOOKUP($CU$161,_Afg07,BR285)*$D$70*IF($F$70<>\"\",$F$70,VLOOKUP($CU$161,_Afg07,Udbyttenr)),0)+IF(VLOOKUP($CU$163,_Afg07,$BU$285)=1,VLOOKUP($CU$163,_Afg07,BR285)*$D$72*IF($F$72<>\"\",$F$72,VLOOKUP($CU$163,_Afg07,Udbyttenr)),0)+IF(VLOOKUP($CU$165,_Afg07,$BU$285)=1,VLOOKUP($CU$165,_Afg07,BR285)*$D$74*IF($F$74<>\"\",$F$74,VLOOKUP($CU$165,_Afg07,Udbyttenr)),0)+IF(VLOOKUP($CU$167,_Afg07,$BU$285)=1,VLOOKUP($CU$167,_Afg07,BR285)*$D$76*IF($F$76<>\"\",$F$76,VLOOKUP($CU$167,_Afg07,Udbyttenr)),0)+IF(VLOOKUP($CU$169,_Afg07,$BU$285)=1,VLOOKUP($CU$169,_Afg07,BR285)*$D$78*IF($F$78<>\"\",$F$78,VLOOKUP($CU$169,_Afg07,Udbyttenr)),0)+IF(VLOOKUP($CU$171,_Afg07,$BU$285)=1,VLOOKUP($CU$171,_Afg07,BR285)*$D$80*IF($F$80<>\"\",$F$80,VLOOKUP($CU$171,_Afg07,Udbyttenr)),0))/($CX$173)","v":{"$error":"#DIV/0!"}},{"$f":"(IF(VLOOKUP($CU$159,_Afg07,$BU$285)=1,VLOOKUP($CU$159,_Afg07,BS285)*$D$68*IF($F$68<>\"\",$F$68,VLOOKUP($CU$159,_Afg07,Udbyttenr)),0)+IF(VLOOKUP($CU$161,_Afg07,$BU$285)=1,VLOOKUP($CU$161,_Afg07,BS285)*$D$70*IF($F$70<>\"\",$F$70,VLOOKUP($CU$161,_Afg07,Udbyttenr)),0)+IF(VLOOKUP($CU$163,_Afg07,$BU$285)=1,VLOOKUP($CU$163,_Afg07,BS285)*$D$72*IF($F$72<>\"\",$F$72,VLOOKUP($CU$163,_Afg07,Udbyttenr)),0)+IF(VLOOKUP($CU$165,_Afg07,$BU$285)=1,VLOOKUP($CU$165,_Afg07,BS285)*$D$74*IF($F$74<>\"\",$F$74,VLOOKUP($CU$165,_Afg07,Udbyttenr)),0)+IF(VLOOKUP($CU$167,_Afg07,$BU$285)=1,VLOOKUP($CU$167,_Afg07,BS285)*$D$76*IF($F$76<>\"\",$F$76,VLOOKUP($CU$167,_Afg07,Udbyttenr)),0)+IF(VLOOKUP($CU$169,_Afg07,$BU$285)=1,VLOOKUP($CU$169,_Afg07,BS285)*$D$78*IF($F$78<>\"\",$F$78,VLOOKUP($CU$169,_Afg07,Udbyttenr)),0)+IF(VLOOKUP($CU$171,_Afg07,$BU$285)=1,VLOOKUP($CU$171,_Afg07,BS285)*$D$80*IF($F$80<>\"\",$F$80,VLOOKUP($CU$171,_Afg07,Udbyttenr)),0))/($CX$173)","v":{"$error":"#DIV/0!"}},{"$f":"(IF(VLOOKUP($CU$159,_Afg07,$BU$285)=1,VLOOKUP($CU$159,_Afg07,BT285)*$D$68*IF($F$68<>\"\",$F$68,VLOOKUP($CU$159,_Afg07,Udbyttenr)),0)+IF(VLOOKUP($CU$161,_Afg07,$BU$285)=1,VLOOKUP($CU$161,_Afg07,BT285)*$D$70*IF($F$70<>\"\",$F$70,VLOOKUP($CU$161,_Afg07,Udbyttenr)),0)+IF(VLOOKUP($CU$163,_Afg07,$BU$285)=1,VLOOKUP($CU$163,_Afg07,BT285)*$D$72*IF($F$72<>\"\",$F$72,VLOOKUP($CU$163,_Afg07,Udbyttenr)),0)+IF(VLOOKUP($CU$165,_Afg07,$BU$285)=1,VLOOKUP($CU$165,_Afg07,BT285)*$D$74*IF($F$74<>\"\",$F$74,VLOOKUP($CU$165,_Afg07,Udbyttenr)),0)+IF(VLOOKUP($CU$167,_Afg07,$BU$285)=1,VLOOKUP($CU$167,_Afg07,BT285)*$D$76*IF($F$76<>\"\",$F$76,VLOOKUP($CU$167,_Afg07,Udbyttenr)),0)+IF(VLOOKUP($CU$169,_Afg07,$BU$285)=1,VLOOKUP($CU$169,_Afg07,BT285)*$D$78*IF($F$78<>\"\",$F$78,VLOOKUP($CU$169,_Afg07,Udbyttenr)),0)+IF(VLOOKUP($CU$171,_Afg07,$BU$285)=1,VLOOKUP($CU$171,_Afg07,BT285)*$D$80*IF($F$80<>\"\",$F$80,VLOOKUP($CU$171,_Afg07,Udbyttenr)),0))/($CX$173)","v":{"$error":"#DIV/0!"}}]
[null,null,null,null,null,null,null,null,null,null,null,null,null,null,null,null,null,2,null,null,null,null,null,null,null,null,{"$f":"(IF(VLOOKUP($CU$160,_Afg07,$BU$285)=1,VLOOKUP($CU$160,_Afg07,AA285)*$D$89,0)+IF(VLOOKUP($CU$162,_Afg07,$BU$285)=1,VLOOKUP($CU$162,_Afg07,AA285)*$D$91,0)+IF(VLOOKUP($CU$164,_Afg07,$BU$285)=1,VLOOKUP($CU$164,_Afg07,AA285)*$D$93,0)+IF(VLOOKUP($CU$166,_Afg07,$BU$285)=1,VLOOKUP($CU$166,_Afg07,AA285)*$D$95,0)+IF(VLOOKUP($CU$168,_Afg07,$BU$285)=1,VLOOKUP($CU$168,_Afg07,AA285)*$D$97,0)+IF(VLOOKUP($CU$170,_Afg07,$BU$285)=1,VLOOKUP($CU$170,_Afg07,AA285)*$D$99,0)+IF(VLOOKUP($CU$172,_Afg07,$BU$285)=1,VLOOKUP($CU$172,_Afg07,AA285)*$D$101,0))/($CY$174)","v":{"$error":"#DIV/0!"}},{"$f":"(IF(VLOOKUP($CU$160,_Afg07,$BU$285)=1,VLOOKUP($CU$160,_Afg07,AB285)*$D$89,0)+IF(VLOOKUP($CU$162,_Afg07,$BU$285)=1,VLOOKUP($CU$162,_Afg07,AB285)*$D$91,0)+IF(VLOOKUP($CU$164,_Afg07,$BU$285)=1,VLOOKUP($CU$164,_Afg07,AB285)*$D$93,0)+IF(VLOOKUP($CU$166,_Afg07,$BU$285)=1,VLOOKUP($CU$166,_Afg07,AB285)*$D$95,0)+IF(VLOOKUP($CU$168,_Afg07,$BU$285)=1,VLOOKUP($CU$168,_Afg07,AB285)*$D$97,0)+IF(VLOOKUP($CU$170,_Afg07,$BU$285)=1,VLOOKUP($CU$170,_Afg07,AB285)*$D$99,0)+IF(VLOOKUP($CU$172,_Afg07,$BU$285)=1,VLOOKUP($CU$172,_Afg07,AB285)*$D$101,0))/($CY$174)","v":{"$error":"#DIV/0!"}},{"$f":"(IF(VLOOKUP($CU$160,_Afg07,$BU$285)=1,VLOOKUP($CU$160,_Afg07,AC285)*$D$89,0)+IF(VLOOKUP($CU$162,_Afg07,$BU$285)=1,VLOOKUP($CU$162,_Afg07,AC285)*$D$91,0)+IF(VLOOKUP($CU$164,_Afg07,$BU$285)=1,VLOOKUP($CU$164,_Afg07,AC285)*$D$93,0)+IF(VLOOKUP($CU$166,_Afg07,$BU$285)=1,VLOOKUP($CU$166,_Afg07,AC285)*$D$95,0)+IF(VLOOKUP($CU$168,_Afg07,$BU$285)=1,VLOOKUP($CU$168,_Afg07,AC285)*$D$97,0)+IF(VLOOKUP($CU$170,_Afg07,$BU$285)=1,VLOOKUP($CU$170,_Afg07,AC285)*$D$99,0)+IF(VLOOKUP($CU$172,_Afg07,$BU$285)=1,VLOOKUP($CU$172,_Afg07,AC285)*$D$101,0))/($CY$174)","v":{"$error":"#DIV/0!"}},{"$f":"(IF(VLOOKUP($CU$160,_Afg07,$BU$285)=1,VLOOKUP($CU$160,_Afg07,AD285)*$D$89,0)+IF(VLOOKUP($CU$162,_Afg07,$BU$285)=1,VLOOKUP($CU$162,_Afg07,AD285)*$D$91,0)+IF(VLOOKUP($CU$164,_Afg07,$BU$285)=1,VLOOKUP($CU$164,_Afg07,AD285)*$D$93,0)+IF(VLOOKUP($CU$166,_Afg07,$BU$285)=1,VLOOKUP($CU$166,_Afg07,AD285)*$D$95,0)+IF(VLOOKUP($CU$168,_Afg07,$BU$285)=1,VLOOKUP($CU$168,_Afg07,AD285)*$D$97,0)+IF(VLOOKUP($CU$170,_Afg07,$BU$285)=1,VLOOKUP($CU$170,_Afg07,AD285)*$D$99,0)+IF(VLOOKUP($CU$172,_Afg07,$BU$285)=1,VLOOKUP($CU$172,_Afg07,AD285)*$D$101,0))/($CY$174)","v":{"$error":"#DIV/0!"}},{"$f":"(IF(VLOOKUP($CU$160,_Afg07,$BU$285)=1,VLOOKUP($CU$160,_Afg07,AE285)*$D$89,0)+IF(VLOOKUP($CU$162,_Afg07,$BU$285)=1,VLOOKUP($CU$162,_Afg07,AE285)*$D$91,0)+IF(VLOOKUP($CU$164,_Afg07,$BU$285)=1,VLOOKUP($CU$164,_Afg07,AE285)*$D$93,0)+IF(VLOOKUP($CU$166,_Afg07,$BU$285)=1,VLOOKUP($CU$166,_Afg07,AE285)*$D$95,0)+IF(VLOOKUP($CU$168,_Afg07,$BU$285)=1,VLOOKUP($CU$168,_Afg07,AE285)*$D$97,0)+IF(VLOOKUP($CU$170,_Afg07,$BU$285)=1,VLOOKUP($CU$170,_Afg07,AE285)*$D$99,0)+IF(VLOOKUP($CU$172,_Afg07,$BU$285)=1,VLOOKUP($CU$172,_Afg07,AE285)*$D$101,0))/($CY$174)","v":{"$error":"#DIV/0!"}},null,null,null,null,null,null,{"$f":"(IF(VLOOKUP($CU$160,_Afg07,$BU$285)=1,VLOOKUP($CU$160,_Afg07,AL285)*$D$89,0)+IF(VLOOKUP($CU$162,_Afg07,$BU$285)=1,VLOOKUP($CU$162,_Afg07,AL285)*$D$91,0)+IF(VLOOKUP($CU$164,_Afg07,$BU$285)=1,VLOOKUP($CU$164,_Afg07,AL285)*$D$93,0)+IF(VLOOKUP($CU$166,_Afg07,$BU$285)=1,VLOOKUP($CU$166,_Afg07,AL285)*$D$95,0)+IF(VLOOKUP($CU$168,_Afg07,$BU$285)=1,VLOOKUP($CU$168,_Afg07,AL285)*$D$97,0)+IF(VLOOKUP($CU$170,_Afg07,$BU$285)=1,VLOOKUP($CU$170,_Afg07,AL285)*$D$99,0)+IF(VLOOKUP($CU$172,_Afg07,$BU$285)=1,VLOOKUP($CU$172,_Afg07,AL285)*$D$101,0))/($CY$174)","v":{"$error":"#DIV/0!"}},{"$f":"(IF(VLOOKUP($CU$160,_Afg07,$BU$285)=1,VLOOKUP($CU$160,_Afg07,AM285)*$D$89,0)+IF(VLOOKUP($CU$162,_Afg07,$BU$285)=1,VLOOKUP($CU$162,_Afg07,AM285)*$D$91,0)+IF(VLOOKUP($CU$164,_Afg07,$BU$285)=1,VLOOKUP($CU$164,_Afg07,AM285)*$D$93,0)+IF(VLOOKUP($CU$166,_Afg07,$BU$285)=1,VLOOKUP($CU$166,_Afg07,AM285)*$D$95,0)+IF(VLOOKUP($CU$168,_Afg07,$BU$285)=1,VLOOKUP($CU$168,_Afg07,AM285)*$D$97,0)+IF(VLOOKUP($CU$170,_Afg07,$BU$285)=1,VLOOKUP($CU$170,_Afg07,AM285)*$D$99,0)+IF(VLOOKUP($CU$172,_Afg07,$BU$285)=1,VLOOKUP($CU$172,_Afg07,AM285)*$D$101,0))/($CY$174)","v":{"$error":"#DIV/0!"}},{"$f":"(IF(VLOOKUP($CU$160,_Afg07,$BU$285)=1,VLOOKUP($CU$160,_Afg07,AN285)*$D$89,0)+IF(VLOOKUP($CU$162,_Afg07,$BU$285)=1,VLOOKUP($CU$162,_Afg07,AN285)*$D$91,0)+IF(VLOOKUP($CU$164,_Afg07,$BU$285)=1,VLOOKUP($CU$164,_Afg07,AN285)*$D$93,0)+IF(VLOOKUP($CU$166,_Afg07,$BU$285)=1,VLOOKUP($CU$166,_Afg07,AN285)*$D$95,0)+IF(VLOOKUP($CU$168,_Afg07,$BU$285)=1,VLOOKUP($CU$168,_Afg07,AN285)*$D$97,0)+IF(VLOOKUP($CU$170,_Afg07,$BU$285)=1,VLOOKUP($CU$170,_Afg07,AN285)*$D$99,0)+IF(VLOOKUP($CU$172,_Afg07,$BU$285)=1,VLOOKUP($CU$172,_Afg07,AN285)*$D$101,0))/($CY$174)","v":{"$error":"#DIV/0!"}},null,{"$f":"(IF(VLOOKUP($CU$160,_Afg07,$BU$285)=1,VLOOKUP($CU$160,_Afg07,AP285)*$D$89,0)+IF(VLOOKUP($CU$162,_Afg07,$BU$285)=1,VLOOKUP($CU$162,_Afg07,AP285)*$D$91,0)+IF(VLOOKUP($CU$164,_Afg07,$BU$285)=1,VLOOKUP($CU$164,_Afg07,AP285)*$D$93,0)+IF(VLOOKUP($CU$166,_Afg07,$BU$285)=1,VLOOKUP($CU$166,_Afg07,AP285)*$D$95,0)+IF(VLOOKUP($CU$168,_Afg07,$BU$285)=1,VLOOKUP($CU$168,_Afg07,AP285)*$D$97,0)+IF(VLOOKUP($CU$170,_Afg07,$BU$285)=1,VLOOKUP($CU$170,_Afg07,AP285)*$D$99,0)+IF(VLOOKUP($CU$172,_Afg07,$BU$285)=1,VLOOKUP($CU$172,_Afg07,AP285)*$D$101,0))/($CY$174)","v":{"$error":"#DIV/0!"}},{"$error":"#DIV/0!"},{"$error":"#DIV/0!"},{"$error":"#DIV/0!"},{"$error":"#DIV/0!"},{"$error":"#DIV/0!"},{"$error":"#DIV/0!"},{"$f":"(IF(VLOOKUP($CU$160,_Afg07,$BU$285)=1,VLOOKUP($CU$160,_Afg07,AW285)*$D$89*IF($F$89<>\"\",$F$89,VLOOKUP($CU$160,_Afg07,Udbyttenr)),0)+IF(VLOOKUP($CU$162,_Afg07,$BU$285)=1,VLOOKUP($CU$162,_Afg07,AW285)*$D$91*IF($F$91<>\"\",$F$91,VLOOKUP($CU$162,_Afg07,Udbyttenr)),0)+IF(VLOOKUP($CU$164,_Afg07,$BU$285)=1,VLOOKUP($CU$164,_Afg07,AW285)*$D$93*IF($F$93<>\"\",$F$93,VLOOKUP($CU$164,_Afg07,Udbyttenr)),0)+IF(VLOOKUP($CU$166,_Afg07,$BU$285)=1,VLOOKUP($CU$166,_Afg07,AW285)*$D$95*IF($F$95<>\"\",$F$95,VLOOKUP($CU$166,_Afg07,Udbyttenr)),0)+IF(VLOOKUP($CU$168,_Afg07,$BU$285)=1,VLOOKUP($CU$168,_Afg07,AW285)*$D$97*IF($F$97<>\"\",$F$97,VLOOKUP($CU$168,_Afg07,Udbyttenr)),0)+IF(VLOOKUP($CU$170,_Afg07,$BU$285)=1,VLOOKUP($CU$170,_Afg07,AW285)*$D$99*IF($F$99<>\"\",$F$99,VLOOKUP($CU$170,_Afg07,Udbyttenr)),0)+IF(VLOOKUP($CU$172,_Afg07,$BU$285)=1,VLOOKUP($CU$172,_Afg07,AW285)*$D$101*IF($F$101<>\"\",$F$101,VLOOKUP($CU$172,_Afg07,Udbyttenr)),0))/($CX$174)","v":{"$error":"#DIV/0!"}},{"$f":"(IF(VLOOKUP($CU$160,_Afg07,$BU$285)=1,VLOOKUP($CU$160,_Afg07,AX285)*$D$89*VLOOKUP($CU$160,_Afg07,Halmnr),0)+IF(VLOOKUP($CU$162,_Afg07,$BU$285)=1,VLOOKUP($CU$162,_Afg07,AX285)*$D$91*VLOOKUP($CU$162,_Afg07,Halmnr),0)+IF(VLOOKUP($CU$164,_Afg07,$BU$285)=1,VLOOKUP($CU$164,_Afg07,AX285)*$D$93*VLOOKUP($CU$164,_Afg07,Halmnr),0)+IF(VLOOKUP($CU$166,_Afg07,$BU$285)=1,VLOOKUP($CU$166,_Afg07,AX285)*$D$95*VLOOKUP($CU$166,_Afg07,Halmnr),0)+IF(VLOOKUP($CU$168,_Afg07,$BU$285)=1,VLOOKUP($CU$168,_Afg07,AX285)*$D$97*VLOOKUP($CU$168,_Afg07,Halmnr),0)+IF(VLOOKUP($CU$170,_Afg07,$BU$285)=1,VLOOKUP($CU$170,_Afg07,AX285)*$D$99*VLOOKUP($CU$170,_Afg07,Halmnr),0)+IF(VLOOKUP($CU$172,_Afg07,$BU$285)=1,VLOOKUP($CU$172,_Afg07,AX285)*$D$101*VLOOKUP($CU$172,_Afg07,Halmnr),0))/($DB$174)","v":{"$error":"#DIV/0!"}},{"$f":"(IF(VLOOKUP($CU$160,_Afg07,$BU$285)=1,VLOOKUP($CU$160,_Afg07,AY285)*$D$89,0)+IF(VLOOKUP($CU$162,_Afg07,$BU$285)=1,VLOOKUP($CU$162,_Afg07,AY285)*$D$91,0)+IF(VLOOKUP($CU$164,_Afg07,$BU$285)=1,VLOOKUP($CU$164,_Afg07,AY285)*$D$93,0)+IF(VLOOKUP($CU$166,_Afg07,$BU$285)=1,VLOOKUP($CU$166,_Afg07,AY285)*$D$95,0)+IF(VLOOKUP($CU$168,_Afg07,$BU$285)=1,VLOOKUP($CU$168,_Afg07,AY285)*$D$97,0)+IF(VLOOKUP($CU$170,_Afg07,$BU$285)=1,VLOOKUP($CU$170,_Afg07,AY285)*$D$99,0)+IF(VLOOKUP($CU$172,_Afg07,$BU$285)=1,VLOOKUP($CU$172,_Afg07,AY285)*$D$101,0))/($CY$174)","v":{"$error":"#DIV/0!"}},{"$f":"(IF(VLOOKUP($CU$160,_Afg07,$BU$285)=1,VLOOKUP($CU$160,_Afg07,AZ285)*$D$89*IF($F$89<>\"\",$F$89,VLOOKUP($CU$160,_Afg07,Udbyttenr)),0)+IF(VLOOKUP($CU$162,_Afg07,$BU$285)=1,VLOOKUP($CU$162,_Afg07,AZ285)*$D$91*IF($F$91<>\"\",$F$91,VLOOKUP($CU$162,_Afg07,Udbyttenr)),0)+IF(VLOOKUP($CU$164,_Afg07,$BU$285)=1,VLOOKUP($CU$164,_Afg07,AZ285)*$D$93*IF($F$93<>\"\",$F$93,VLOOKUP($CU$164,_Afg07,Udbyttenr)),0)+IF(VLOOKUP($CU$166,_Afg07,$BU$285)=1,VLOOKUP($CU$166,_Afg07,AZ285)*$D$95*IF($F$95<>\"\",$F$95,VLOOKUP($CU$166,_Afg07,Udbyttenr)),0)+IF(VLOOKUP($CU$168,_Afg07,$BU$285)=1,VLOOKUP($CU$168,_Afg07,AZ285)*$D$97*IF($F$97<>\"\",$F$97,VLOOKUP($CU$168,_Afg07,Udbyttenr)),0)+IF(VLOOKUP($CU$170,_Afg07,$BU$285)=1,VLOOKUP($CU$170,_Afg07,AZ285)*$D$99*IF($F$99<>\"\",$F$99,VLOOKUP($CU$170,_Afg07,Udbyttenr)),0)+IF(VLOOKUP($CU$172,_Afg07,$BU$285)=1,VLOOKUP($CU$172,_Afg07,AZ285)*$D$101*IF($F$101<>\"\",$F$101,VLOOKUP($CU$172,_Afg07,Udbyttenr)),0))/($CX$174)","v":{"$error":"#DIV/0!"}},{"$f":"(IF(VLOOKUP($CU$160,_Afg07,$BU$285)=1,VLOOKUP($CU$160,_Afg07,BA285)*$D$89*VLOOKUP($CU$160,_Afg07,Halmnr),0)+IF(VLOOKUP($CU$162,_Afg07,$BU$285)=1,VLOOKUP($CU$162,_Afg07,BA285)*$D$91*VLOOKUP($CU$162,_Afg07,Halmnr),0)+IF(VLOOKUP($CU$164,_Afg07,$BU$285)=1,VLOOKUP($CU$164,_Afg07,BA285)*$D$93*VLOOKUP($CU$164,_Afg07,Halmnr),0)+IF(VLOOKUP($CU$166,_Afg07,$BU$285)=1,VLOOKUP($CU$166,_Afg07,BA285)*$D$95*VLOOKUP($CU$166,_Afg07,Halmnr),0)+IF(VLOOKUP($CU$168,_Afg07,$BU$285)=1,VLOOKUP($CU$168,_Afg07,BA285)*$D$97*VLOOKUP($CU$168,_Afg07,Halmnr),0)+IF(VLOOKUP($CU$170,_Afg07,$BU$285)=1,VLOOKUP($CU$170,_Afg07,BA285)*$D$99*VLOOKUP($CU$170,_Afg07,Halmnr),0)+IF(VLOOKUP($CU$172,_Afg07,$BU$285)=1,VLOOKUP($CU$172,_Afg07,BA285)*$D$101*VLOOKUP($CU$172,_Afg07,Halmnr),0))/($DB$174)","v":{"$error":"#DIV/0!"}},{"$f":"(IF(VLOOKUP($CU$160,_Afg07,$BU$285)=1,VLOOKUP($CU$160,_Afg07,BB285)*$D$89*IF($F$89<>\"\",$F$89,VLOOKUP($CU$160,_Afg07,Udbyttenr)),0)+IF(VLOOKUP($CU$162,_Afg07,$BU$285)=1,VLOOKUP($CU$162,_Afg07,BB285)*$D$91*IF($F$91<>\"\",$F$91,VLOOKUP($CU$162,_Afg07,Udbyttenr)),0)+IF(VLOOKUP($CU$164,_Afg07,$BU$285)=1,VLOOKUP($CU$164,_Afg07,BB285)*$D$93*IF($F$93<>\"\",$F$93,VLOOKUP($CU$164,_Afg07,Udbyttenr)),0)+IF(VLOOKUP($CU$166,_Afg07,$BU$285)=1,VLOOKUP($CU$166,_Afg07,BB285)*$D$95*IF($F$95<>\"\",$F$95,VLOOKUP($CU$166,_Afg07,Udbyttenr)),0)+IF(VLOOKUP($CU$168,_Afg07,$BU$285)=1,VLOOKUP($CU$168,_Afg07,BB285)*$D$97*IF($F$97<>\"\",$F$97,VLOOKUP($CU$168,_Afg07,Udbyttenr)),0)+IF(VLOOKUP($CU$170,_Afg07,$BU$285)=1,VLOOKUP($CU$170,_Afg07,BB285)*$D$99*IF($F$99<>\"\",$F$99,VLOOKUP($CU$170,_Afg07,Udbyttenr)),0)+IF(VLOOKUP($CU$172,_Afg07,$BU$285)=1,VLOOKUP($CU$172,_Afg07,BB285)*$D$101*IF($F$101<>\"\",$F$101,VLOOKUP($CU$172,_Afg07,Udbyttenr)),0))/($CX$174)","v":{"$error":"#DIV/0!"}},null,{"$f":"(IF(VLOOKUP($CU$160,_Afg07,$BU$285)=1,VLOOKUP($CU$160,_Afg07,BD285)*$D$89,0)+IF(VLOOKUP($CU$162,_Afg07,$BU$285)=1,VLOOKUP($CU$162,_Afg07,BD285)*$D$91,0)+IF(VLOOKUP($CU$164,_Afg07,$BU$285)=1,VLOOKUP($CU$164,_Afg07,BD285)*$D$93,0)+IF(VLOOKUP($CU$166,_Afg07,$BU$285)=1,VLOOKUP($CU$166,_Afg07,BD285)*$D$95,0)+IF(VLOOKUP($CU$168,_Afg07,$BU$285)=1,VLOOKUP($CU$168,_Afg07,BD285)*$D$97,0)+IF(VLOOKUP($CU$170,_Afg07,$BU$285)=1,VLOOKUP($CU$170,_Afg07,BD285)*$D$99,0)+IF(VLOOKUP($CU$172,_Afg07,$BU$285)=1,VLOOKUP($CU$172,_Afg07,BD285)*$D$101,0))/($CY$174)","v":{"$error":"#DIV/0!"}},{"$error":"#DIV/0!"},{"$error":"#DIV/0!"},{"$error":"#DIV/0!"},{"$error":"#DIV/0!"},{"$error":"#DIV/0!"},{"$error":"#DIV/0!"},{"$error":"#DIV/0!"},{"$error":"#DIV/0!"},{"$error":"#DIV/0!"},{"$f":"(IF(VLOOKUP($CU$160,_Afg07,$BU$285)=1,VLOOKUP($CU$160,_Afg07,BN285)*$D$89*IF($F$89<>\"\",$F$89,VLOOKUP($CU$160,_Afg07,Udbyttenr)),0)+IF(VLOOKUP($CU$162,_Afg07,$BU$285)=1,VLOOKUP($CU$162,_Afg07,BN285)*$D$91*IF($F$91<>\"\",$F$91,VLOOKUP($CU$162,_Afg07,Udbyttenr)),0)+IF(VLOOKUP($CU$164,_Afg07,$BU$285)=1,VLOOKUP($CU$164,_Afg07,BN285)*$D$93*IF($F$93<>\"\",$F$93,VLOOKUP($CU$164,_Afg07,Udbyttenr)),0)+IF(VLOOKUP($CU$166,_Afg07,$BU$285)=1,VLOOKUP($CU$166,_Afg07,BN285)*$D$95*IF($F$95<>\"\",$F$95,VLOOKUP($CU$166,_Afg07,Udbyttenr)),0)+IF(VLOOKUP($CU$168,_Afg07,$BU$285)=1,VLOOKUP($CU$168,_Afg07,BN285)*$D$97*IF($F$97<>\"\",$F$97,VLOOKUP($CU$168,_Afg07,Udbyttenr)),0)+IF(VLOOKUP($CU$170,_Afg07,$BU$285)=1,VLOOKUP($CU$170,_Afg07,BN285)*$D$99*IF($F$99<>\"\",$F$99,VLOOKUP($CU$170,_Afg07,Udbyttenr)),0)+IF(VLOOKUP($CU$172,_Afg07,$BU$285)=1,VLOOKUP($CU$172,_Afg07,BN285)*$D$101*IF($F$101<>\"\",$F$101,VLOOKUP($CU$172,_Afg07,Udbyttenr)),0))/($CX$174)","v":{"$error":"#DIV/0!"}},{"$f":"(IF(VLOOKUP($CU$160,_Afg07,$BU$285)=1,VLOOKUP($CU$160,_Afg07,BO285)*$D$89*IF($F$89<>\"\",$F$89,VLOOKUP($CU$160,_Afg07,Udbyttenr)),0)+IF(VLOOKUP($CU$162,_Afg07,$BU$285)=1,VLOOKUP($CU$162,_Afg07,BO285)*$D$91*IF($F$91<>\"\",$F$91,VLOOKUP($CU$162,_Afg07,Udbyttenr)),0)+IF(VLOOKUP($CU$164,_Afg07,$BU$285)=1,VLOOKUP($CU$164,_Afg07,BO285)*$D$93*IF($F$93<>\"\",$F$93,VLOOKUP($CU$164,_Afg07,Udbyttenr)),0)+IF(VLOOKUP($CU$166,_Afg07,$BU$285)=1,VLOOKUP($CU$166,_Afg07,BO285)*$D$95*IF($F$95<>\"\",$F$95,VLOOKUP($CU$166,_Afg07,Udbyttenr)),0)+IF(VLOOKUP($CU$168,_Afg07,$BU$285)=1,VLOOKUP($CU$168,_Afg07,BO285)*$D$97*IF($F$97<>\"\",$F$97,VLOOKUP($CU$168,_Afg07,Udbyttenr)),0)+IF(VLOOKUP($CU$170,_Afg07,$BU$285)=1,VLOOKUP($CU$170,_Afg07,BO285)*$D$99*IF($F$99<>\"\",$F$99,VLOOKUP($CU$170,_Afg07,Udbyttenr)),0)+IF(VLOOKUP($CU$172,_Afg07,$BU$285)=1,VLOOKUP($CU$172,_Afg07,BO285)*$D$101*IF($F$101<>\"\",$F$101,VLOOKUP($CU$172,_Afg07,Udbyttenr)),0))/($CX$174)","v":{"$error":"#DIV/0!"}},null,{"$f":"(IF(VLOOKUP($CU$160,_Afg07,$BU$285)=1,VLOOKUP($CU$160,_Afg07,BQ285)*$D$89*IF($F$89<>\"\",$F$89,VLOOKUP($CU$160,_Afg07,Udbyttenr)),0)+IF(VLOOKUP($CU$162,_Afg07,$BU$285)=1,VLOOKUP($CU$162,_Afg07,BQ285)*$D$91*IF($F$91<>\"\",$F$91,VLOOKUP($CU$162,_Afg07,Udbyttenr)),0)+IF(VLOOKUP($CU$164,_Afg07,$BU$285)=1,VLOOKUP($CU$164,_Afg07,BQ285)*$D$93*IF($F$93<>\"\",$F$93,VLOOKUP($CU$164,_Afg07,Udbyttenr)),0)+IF(VLOOKUP($CU$166,_Afg07,$BU$285)=1,VLOOKUP($CU$166,_Afg07,BQ285)*$D$95*IF($F$95<>\"\",$F$95,VLOOKUP($CU$166,_Afg07,Udbyttenr)),0)+IF(VLOOKUP($CU$168,_Afg07,$BU$285)=1,VLOOKUP($CU$168,_Afg07,BQ285)*$D$97*IF($F$97<>\"\",$F$97,VLOOKUP($CU$168,_Afg07,Udbyttenr)),0)+IF(VLOOKUP($CU$170,_Afg07,$BU$285)=1,VLOOKUP($CU$170,_Afg07,BQ285)*$D$99*IF($F$99<>\"\",$F$99,VLOOKUP($CU$170,_Afg07,Udbyttenr)),0)+IF(VLOOKUP($CU$172,_Afg07,$BU$285)=1,VLOOKUP($CU$172,_Afg07,BQ285)*$D$101*IF($F$101<>\"\",$F$101,VLOOKUP($CU$172,_Afg07,Udbyttenr)),0))/($CX$174)","v":{"$error":"#DIV/0!"}},{"$f":"(IF(VLOOKUP($CU$160,_Afg07,$BU$285)=1,VLOOKUP($CU$160,_Afg07,BR285)*$D$89*IF($F$89<>\"\",$F$89,VLOOKUP($CU$160,_Afg07,Udbyttenr)),0)+IF(VLOOKUP($CU$162,_Afg07,$BU$285)=1,VLOOKUP($CU$162,_Afg07,BR285)*$D$91*IF($F$91<>\"\",$F$91,VLOOKUP($CU$162,_Afg07,Udbyttenr)),0)+IF(VLOOKUP($CU$164,_Afg07,$BU$285)=1,VLOOKUP($CU$164,_Afg07,BR285)*$D$93*IF($F$93<>\"\",$F$93,VLOOKUP($CU$164,_Afg07,Udbyttenr)),0)+IF(VLOOKUP($CU$166,_Afg07,$BU$285)=1,VLOOKUP($CU$166,_Afg07,BR285)*$D$95*IF($F$95<>\"\",$F$95,VLOOKUP($CU$166,_Afg07,Udbyttenr)),0)+IF(VLOOKUP($CU$168,_Afg07,$BU$285)=1,VLOOKUP($CU$168,_Afg07,BR285)*$D$97*IF($F$97<>\"\",$F$97,VLOOKUP($CU$168,_Afg07,Udbyttenr)),0)+IF(VLOOKUP($CU$170,_Afg07,$BU$285)=1,VLOOKUP($CU$170,_Afg07,BR285)*$D$99*IF($F$99<>\"\",$F$99,VLOOKUP($CU$170,_Afg07,Udbyttenr)),0)+IF(VLOOKUP($CU$172,_Afg07,$BU$285)=1,VLOOKUP($CU$172,_Afg07,BR285)*$D$101*IF($F$101<>\"\",$F$101,VLOOKUP($CU$172,_Afg07,Udbyttenr)),0))/($CX$174)","v":{"$error":"#DIV/0!"}},{"$f":"(IF(VLOOKUP($CU$160,_Afg07,$BU$285)=1,VLOOKUP($CU$160,_Afg07,BS285)*$D$89*IF($F$89<>\"\",$F$89,VLOOKUP($CU$160,_Afg07,Udbyttenr)),0)+IF(VLOOKUP($CU$162,_Afg07,$BU$285)=1,VLOOKUP($CU$162,_Afg07,BS285)*$D$91*IF($F$91<>\"\",$F$91,VLOOKUP($CU$162,_Afg07,Udbyttenr)),0)+IF(VLOOKUP($CU$164,_Afg07,$BU$285)=1,VLOOKUP($CU$164,_Afg07,BS285)*$D$93*IF($F$93<>\"\",$F$93,VLOOKUP($CU$164,_Afg07,Udbyttenr)),0)+IF(VLOOKUP($CU$166,_Afg07,$BU$285)=1,VLOOKUP($CU$166,_Afg07,BS285)*$D$95*IF($F$95<>\"\",$F$95,VLOOKUP($CU$166,_Afg07,Udbyttenr)),0)+IF(VLOOKUP($CU$168,_Afg07,$BU$285)=1,VLOOKUP($CU$168,_Afg07,BS285)*$D$97*IF($F$97<>\"\",$F$97,VLOOKUP($CU$168,_Afg07,Udbyttenr)),0)+IF(VLOOKUP($CU$170,_Afg07,$BU$285)=1,VLOOKUP($CU$170,_Afg07,BS285)*$D$99*IF($F$99<>\"\",$F$99,VLOOKUP($CU$170,_Afg07,Udbyttenr)),0)+IF(VLOOKUP($CU$172,_Afg07,$BU$285)=1,VLOOKUP($CU$172,_Afg07,BS285)*$D$101*IF($F$101<>\"\",$F$101,VLOOKUP($CU$172,_Afg07,Udbyttenr)),0))/($CX$174)","v":{"$error":"#DIV/0!"}},{"$f":"(IF(VLOOKUP($CU$160,_Afg07,$BU$285)=1,VLOOKUP($CU$160,_Afg07,BT285)*$D$89*IF($F$89<>\"\",$F$89,VLOOKUP($CU$160,_Afg07,Udbyttenr)),0)+IF(VLOOKUP($CU$162,_Afg07,$BU$285)=1,VLOOKUP($CU$162,_Afg07,BT285)*$D$91*IF($F$91<>\"\",$F$91,VLOOKUP($CU$162,_Afg07,Udbyttenr)),0)+IF(VLOOKUP($CU$164,_Afg07,$BU$285)=1,VLOOKUP($CU$164,_Afg07,BT285)*$D$93*IF($F$93<>\"\",$F$93,VLOOKUP($CU$164,_Afg07,Udbyttenr)),0)+IF(VLOOKUP($CU$166,_Afg07,$BU$285)=1,VLOOKUP($CU$166,_Afg07,BT285)*$D$95*IF($F$95<>\"\",$F$95,VLOOKUP($CU$166,_Afg07,Udbyttenr)),0)+IF(VLOOKUP($CU$168,_Afg07,$BU$285)=1,VLOOKUP($CU$168,_Afg07,BT285)*$D$97*IF($F$97<>\"\",$F$97,VLOOKUP($CU$168,_Afg07,Udbyttenr)),0)+IF(VLOOKUP($CU$170,_Afg07,$BU$285)=1,VLOOKUP($CU$170,_Afg07,BT285)*$D$99*IF($F$99<>\"\",$F$99,VLOOKUP($CU$170,_Afg07,Udbyttenr)),0)+IF(VLOOKUP($CU$172,_Afg07,$BU$285)=1,VLOOKUP($CU$172,_Afg07,BT285)*$D$101*IF($F$101<>\"\",$F$101,VLOOKUP($CU$172,_Afg07,Udbyttenr)),0))/($CX$174)","v":{"$error":"#DIV/0!"}}]
[]
[]
[null,null,null,null,null,null,null,null,null,null,null,null,null,null,null,null,null,null,"Den samlede økonomi for hele markbruget (alle ha i sædskifterne) er beregnet ud fra de samme tal, som vises på side 1. "]
[]
[]
[]
[]
[]
[]
[]
[]
[]
[]
[]
[null,null,null,null,null,null,null,null,null,null,null,null,null,null,null,null,null,null,{"$f":"IF(AND(C239>C240,C234=\"\"),\"Foderbehov er større end foder produceret; men du har angivet, at bedriften er kornsælger.\",IF(AND(C240>C239,C234<>\"\"),\"Foder produceret er større end foderbehov; men du har angivet, at bedriften er kornkøber.\",\"\"))","v":""}]
[]
[]
[]
[]
[]
[]
[]
[]
[]
[]
[]
[]
[]
[]
[]
[]
[null,"Bemærk at nedenstående beregninger tager ikke hensyn til \"egen afgrøde\""]
[]
[]
[null,"Foderbehov"]
[]
[null,null,null,"Besætning",null,null,"Vægtinterval",null,null,null," Foderforbrug",null,null,null,null,null,null,null,null,null,null,null,null,null,null,null,null,null,null,null,null,null,null,null,null,null,null,null,null,null,null,null,null,null,null,null,null,null,null,null,null,null,null,null,null,null,null,null,null,null,null,null,null,null,null,null,null,null,null,null,null,null,null,null,null,null,null,null,null,null,null,null,null,null,null,null,null,null,null,null,null,null,null,null,null,null,null,null,null,null,null,"Foderforbrug_FE","Korn-FE"]
[]
[null,"Søer m. smågrise",null,null,"årssøer",null,null,null,null,null,{"$f":"IF(M385<>\"\",\"\",1482)","v":1482},{"$f":"IF(K385<>\"\",\"FE\",\"\")","v":"FE"},null,"FE",null,null,null,null,"Du kan beregne besætningens foderbehov (korn) i foderenheder. Resultatet bliver vist på udskriften side 2, så man kan vurdere, om bedriften er netto kornkøber eller kornsælger.",null,null,null,null,null,null,null,null,null,null,null,null,null,null,null,null,null,null,null,null,null,null,null,null,null,null,null,null,null,null,null,null,null,null,null,null,null,null,null,null,null,null,null,null,null,null,null,null,null,null,null,null,null,null,null,null,null,null,null,null,null,null,null,null,null,null,null,null,null,null,null,null,null,null,null,null,null,null,null,81,"%",null,{"$f":"D385*IF(M385<>\"\",M385,K385)","v":0},{"$f":"CX385*CU385*0.01","v":0}]
[]
[null,"Smågrise",null,null,"stk.",null,7,"kg",32,"kg",{"$f":"IF(M387<>\"\",\"\",1.98)","v":1.98},{"$f":"IF(K387<>\"\",\"Fesv\",\"\")","v":"Fesv"},null,"Fesv",null,null,null,null,null,null,null,null,null,null,null,null,null,null,null,null,null,null,null,null,null,null,null,null,null,null,null,null,null,null,null,null,null,null,null,null,null,null,null,null,null,null,null,null,null,null,null,null,null,null,null,null,null,null,null,null,null,null,null,null,null,null,null,null,null,null,null,null,null,null,null,null,null,null,null,null,null,null,null,null,null,null,null,null,68,"%",null,{"$f":"D387*(I387-G387)*IF(M387<>\"\",M387,K387)","v":0},{"$f":"CX387*CU387*0.01","v":0}]
[]
[null,"Slagtesvin",null,null,"stk.",null,32,"kg",107,"kg",{"$f":"IF(M389<>\"\",\"\",2.83)","v":2.83},{"$f":"IF(K389<>\"\",\"Fesv\",\"\")","v":"Fesv"},null,"Fesv",null,null,null,null,null,null,null,null,null,null,null,null,null,null,null,null,null,null,null,null,null,null,null,null,null,null,null,null,null,null,null,null,null,null,null,null,null,null,null,null,null,null,null,null,null,null,null,null,null,null,null,null,null,null,null,null,null,null,null,null,null,null,null,null,null,null,null,null,null,null,null,null,null,null,null,null,null,null,null,null,null,null,null,null,78,"%",null,{"$f":"D389*(I389-G389)*IF(M389<>\"\",M389,K389)","v":0},{"$f":"CX389*CU389*0.01","v":0}]
[]
[null,"Foderbehov (korn)",{"$f":"IF(CY385+CY387+CY389=0,0,CY385+CY387+CY389)","v":0},null,"Fesv i alt"]
[]
[]
[null,"Bemærk at nedenstående beregninger tager ikke hensyn til \"egen afgrøde\""]
[null,"Tidsforbrug til jordbearbejdning, såning og høst"]
[null,null,null,null,null,null,null,null,null,null,null,null,null,null,null,null,null,null,"Der kan beregnes tidsforbrug (netto) og arbejdsprofil for forskellige sædskifter og forskellige bedriftsstørrelser.\nAngivelse af om der pløjes eller harves mv. anvendes kun til beregning af tidsforbrug.\nDet har ingen indflydelse på de økonomiske beregninger. Tidsforbrug beregnes for 'Sædskifte 1' og 'Sædskifte 2'."]
[]
[null,"Sædskifte 1",null,null,"Harvning",null," Såbeds-",null,"Glyphosat"]
[null,null," Pløjning",null,"e. høst",null," harvning",null,"før såning"]
[]
[null,{"$f":"IF(CU159=1,\"\",VLOOKUP(CU159,_Afg07,2))","v":""}]
[]
[null,{"$f":"IF(CU161=1,\"\",VLOOKUP(CU161,_Afg07,2))","v":""}]
[]
[null,{"$f":"IF(CU163=1,\"\",VLOOKUP(CU163,_Afg07,2))","v":""}]
[]
[null,{"$f":"IF(CU165=1,\"\",VLOOKUP(CU165,_Afg07,2))","v":""}]
[]
[null,{"$f":"IF(CU167=1,\"\",VLOOKUP(CU167,_Afg07,2))","v":""}]
[]
[null,{"$f":"IF(CU169=1,\"\",VLOOKUP(CU169,_Afg07,2))","v":""}]
[]
[null,{"$f":"IF(CU171=1,\"\",VLOOKUP(CU171,_Afg07,2))","v":""}]
[]
[]
[null,"Sædskifte 2",null,null,"Harvning",null," Såbeds-",null,"Glyphosat"]
[null,null," Pløjning",null,"e. høst",null," harvning",null,"før såning"]
[]
[null,{"$f":"IF(CU160=1,\"\",VLOOKUP(CU160,_Afg07,2))","v":""}]
[]
[null,{"$f":"IF(CU162=1,\"\",VLOOKUP(CU162,_Afg07,2))","v":""}]
[]
[null,{"$f":"IF(CU164=1,\"\",VLOOKUP(CU164,_Afg07,2))","v":""}]
[]
[null,{"$f":"IF(CU166=1,\"\",VLOOKUP(CU166,_Afg07,2))","v":""}]
[]
[null,{"$f":"IF(CU168=1,\"\",VLOOKUP(CU168,_Afg07,2))","v":""}]
[]
[null,{"$f":"IF(CU170=1,\"\",VLOOKUP(CU170,_Afg07,2))","v":""}]
[]
[null,{"$f":"IF(CU172=1,\"\",VLOOKUP(CU172,_Afg07,2))","v":""}]
[]
[]
[null,"Maskinkapaciteter",null,null,null,null,null,"Norm",null,null,"Egen\nkapacitet"]
[null,null,null,null,null,null,null,"kapacitet"]
[]
[null,"Plov",null,null,null,null,null,{"$f":"VLOOKUP(DN155,Plov,3)","v":1.6},"ha/time",null,null,"ha/time"]
[null,null,null,null,null,null,null,null,null,null,null,null,null,null,null,null,null,null,"Valg af maskintyper har kun betydning for beregning af tidsforbrug. Det har ingen indvirkning på de økonomiske beregninger.\nDu kan angive dine egne maskinkapaciteter. Ellers anvendes den valgte normkapacitet.\nI række 5 vælges om halmen nedmuldes eller bjærges."]
[null,"Stubharve",null,null,null,null,null,{"$f":"VLOOKUP(DP155,Stubh,3)","v":2.7},"ha/time",null,null,"ha/time"]
[]
[null,"Såbedsharve",null,null,null,null,null,{"$f":"VLOOKUP(DR155,Såbedh,3)","v":4.7},"ha/time",null,null,"ha/time"]
[]
[null,"Marksprøjte",null,null,null,null,null,{"$f":"VLOOKUP(DT155,Sprøjte,3)","v":5.3},"ha/time",null,null,"ha/time"]
[]
[null,"Gødningsspreder",null,null,null,null,null,{"$f":"VLOOKUP(ED155,Spreder,4)","v":9},"ha/time",null,null,"ha/time"]
[]
[null,"Gyllevogn",null,null,null,null,null,{"$f":"VLOOKUP(EB155,Gylle,4)","v":60},"ton/time",null,null,"ton/time"]
[]
[null,"Såmaskine",null,null,null,null,null,{"$f":"VLOOKUP(DV155,Såmaskine,3)","v":2.9},"ha/time",null,null,"ha/time"]
[]
[null,"Enkornsåmaskine.",null,null,null,null,null,{"$f":"VLOOKUP(EF155,Enkorn,3)","v":2.6},"ha/time",null,null,"ha/time"]
[]
[null,"Kartoffellægger",null,null,null,null,null,{"$f":"VLOOKUP(EH155,Kartoffellægger,4)","v":0.7},"ha/time",null,null,"ha/time"]
[]
[null,"Mejetærsker",null,null,null,null,null,{"$f":"VLOOKUP(DX155,Mejetærsker,3)","v":1.9},"ha/time",null,null,"ha/time"]
[]
[null,"Halmpresser",null,null,null,null,null,{"$f":"VLOOKUP(DZ155,Halmpresser,3)","v":5.3},"ha/time",null,null,"ha/time",{"$f":"VLOOKUP(DZ155,Halmpresser,4)","v":3.2},"ha/time (transport)"]
[]
[null,"Kartoffeloptager",null,null,null,null,null,{"$f":"VLOOKUP(EJ155,Kartoffeloptager,4)","v":0.8},"ha/time",null,null,"ha/time"]
[]
[null,"Roeoptager",null,null,null,null,null,{"$f":"VLOOKUP(EL155,Roeoptager,4)","v":1.3},"ha/time",null,null,"ha/time"]
[]
[]
[null,"Udskrift (side 3):"]
[]
[null,{"$f":"\"Tidsforbrug (netto) i markbruget \"&Aar","v":"Tidsforbrug (netto) i markbruget 2021"}]
[]
[null,"Nedenfor er beregnet tidsforbruget til jordbearbejdning, såning, gødskning, planteværn, høst og"]
[null,"halmbjærgning. Det er beregnet som netto tidsforbrug. Det vil sige, at klargøring, vedligehold",null,null,null,null,null,null,null,null,null,null,null,null,null,null,null,null,"Tidsforbrug til jordbearbejdning og såning er fordelt på 4 perioder:\nPløjning er fordelt på august (vinterraps), september (vintersæd) og vinter (vårsæd). Såning er fordelt på august (vinterraps), september (vintersæd) og forår (vårsæd). Såbedsharvning er fordelt på samme måde som såning. Harvning efter høst er fordelt efter høstperiode."]
[null,"reparationsarbejde, transporttid og ventetid ikke er indregnet."]
[]
[null,null,null,null,null,{"$f":"F217","v":""},null,{"$f":"I217","v":""}]
[null,"Tidsforbrug (netto) i alt",null,{"$f":"IF(ISERROR(D483+D499+D500+D501+D510),\"\",(D483+D499+D500+D501+D510))","v":""},{"$f":"IF(D473=\"\",\"\",\"timer\")","v":""},null,null,{"$f":"IF(ISERROR(H483+H499+H500+H501+H510),\"\",(H483+H499+H500+H501+H510))","v":""},{"$f":"IF(H473=\"\",\"\",\"timer\")","v":""}]
[null,"Tidsforbrug pr. ha (gns.)",null,{"$f":"IF(ISERROR(D473/D82),\"\",(D473/D82))","v":""},{"$f":"IF(D474=\"\",\"\",\"timer\")","v":""},null,null,{"$f":"IF(ISERROR(H473/D103),\"\",(H473/D103))","v":""},{"$f":"IF(H474=\"\",\"\",\"timer\")","v":""}]
[]
[null,"Tidsforbrug til jordbearbejdning og såning"]
[]
[null,null,null,null,null,{"$f":"F217","v":""},null,{"$f":"I217","v":""}]
[null,"Forår",null,{"$f":"IF($F$217=\"\",\"\",EB173+EE173+EH173+EP173+EQ173)","v":""},{"$f":"IF(D479=\"\",\"\",\"timer\")","v":""},null,null,{"$f":"IF($I$217=\"\",\"\",EB174+EE174+EH174+EP174+EQ174)","v":""},{"$f":"IF(H479=\"\",\"\",\"timer\")","v":""}]
[null,"August",null,{"$f":"IF($F$217=\"\",\"\",DW173+DY173+DZ173+EC173+EF173+EI173)","v":""},{"$f":"IF(D480=\"\",\"\",\"timer\")","v":""},null,null,{"$f":"IF($I$217=\"\",\"\",DW174+DY174+DZ174+EC174+EF174+EI174)","v":""},{"$f":"IF(H480=\"\",\"\",\"timer\")","v":""}]
[null,"September",null,{"$f":"IF($F$217=\"\",\"\",DX173+ED173+EG173+EJ173)","v":""},{"$f":"IF(D481=\"\",\"\",\"timer\")","v":""},null,null,{"$f":"IF($I$217=\"\",\"\",DX174+ED174+EG174+EJ174)","v":""},{"$f":"IF(H481=\"\",\"\",\"timer\")","v":""}]
[null,"Vinter",null,{"$f":"IF($F$217=\"\",\"\",DV173)","v":""},{"$f":"IF(D482=\"\",\"\",\"timer\")","v":""},null,null,{"$f":"IF($I$217=\"\",\"\",DV174)","v":""},{"$f":"IF(H482=\"\",\"\",\"timer\")","v":""}]
[null,"I alt",null,{"$f":"IF($F$217=\"\",\"\",D479+D480+D481+D482)","v":""},{"$f":"IF(D483=\"\",\"\",\"timer\")","v":""},null,null,{"$f":"IF($I$217=\"\",\"\",H479+H480+H481+H482)","v":""},{"$f":"IF(H483=\"\",\"\",\"timer\")","v":""}]
[]
[]
[]
[]
[]
[]
[]
[]
[]
[]
[]
[]
[null,"Tidsforbrug til gødskning og planteværn"]
[]
[null,null,null,null,null,{"$f":"F217","v":""},null,{"$f":"I217","v":""}]
[null,"Handelsgødning",null,{"$f":"IF($F$217=\"\",\"\",EU173)","v":""},{"$f":"IF(D499=\"\",\"\",\"timer\")","v":""},null,null,{"$f":"IF($I$217=\"\",\"\",EU174)","v":""},{"$f":"IF(H499=\"\",\"\",\"timer\")","v":""}]
[null,"Husdyrgødning",null,{"$f":"IF($F$217=\"\",\"\",EV173)","v":""},{"$f":"IF(D500=\"\",\"\",\"timer\")","v":""},null,null,{"$f":"IF($I$217=\"\",\"\",EV174)","v":""},{"$f":"IF(H500=\"\",\"\",\"timer\")","v":""}]
[null,"Planteværn",null,{"$f":"IF($F$217=\"\",\"\",ET173)","v":""},{"$f":"IF(D501=\"\",\"\",\"timer\")","v":""},null,null,{"$f":"IF($I$217=\"\",\"\",ET174)","v":""},{"$f":"IF(H501=\"\",\"\",\"timer\")","v":""}]
[]
[null,{"$f":"IF(HalmJa=1,\"Tidsforbrug til høst (mejetærskning, optagning og halmbjærgning)\",\"Tidsforbrug til høst (mejetærskning og optagning)\")","v":"Tidsforbrug til høst (mejetærskning, optagning og halmbjærgning)"}]
[]
[null,null,null,null,null,{"$f":"F217","v":""},null,{"$f":"I217","v":""}]
[null,"Juli",null,{"$f":"IF($F$217=\"\",\"\",EK173+EN173)","v":""},{"$f":"IF(D506=\"\",\"\",\"timer\")","v":""},null,null,{"$f":"IF($I$217=\"\",\"\",EK174+EN174)","v":""},{"$f":"IF(H506=\"\",\"\",\"timer\")","v":""},null,null,null,null,null,null,null,null,null,"Høst af afgrøder er fordelt på 4 perioder: \nHøst i juli omfatter vinterbyg, vinterraps og tidlig frøgræs.\nHøst i august omfatter kornafgrøderne (undtagen vinterbyg), vårraps og markært samt sildig frøgræs.\nHøst i september omfatter hestebønner og kartofler.\nHøst i oktober omfatter majs til modenhed.\nDer korrigeres automatisk for høstkapaciteten i de enkelte afgrøder (i forhold til vårbyg)."]
[null,"August",null,{"$f":"IF($F$217=\"\",\"\",EL173+EO173)","v":""},{"$f":"IF(D507=\"\",\"\",\"timer\")","v":""},null,null,{"$f":"IF($I$217=\"\",\"\",EL174+EO174)","v":""},{"$f":"IF(H507=\"\",\"\",\"timer\")","v":""}]
[null,"September",null,{"$f":"IF($F$217=\"\",\"\",ER173)","v":""},{"$f":"IF(D508=\"\",\"\",\"timer\")","v":""},null,null,{"$f":"IF($I$217=\"\",\"\",ER174)","v":""},{"$f":"IF(H508=\"\",\"\",\"timer\")","v":""}]
[null,"Oktober",null,{"$f":"IF($F$217=\"\",\"\",EM173+ES173)","v":""},{"$f":"IF(D509=\"\",\"\",\"timer\")","v":""},null,null,{"$f":"IF($I$217=\"\",\"\",EM174+ES174)","v":""},{"$f":"IF(H509=\"\",\"\",\"timer\")","v":""}]
[null,"I alt",null,{"$f":"IF($F$217=\"\",\"\",D506+D507+D509+D508)","v":""},{"$f":"IF(D510=\"\",\"\",\"timer\")","v":""},null,null,{"$f":"IF($I$217=\"\",\"\",H506+H507+H509+H508)","v":""},{"$f":"IF(H510=\"\",\"\",\"timer\")","v":""}]
[]
[]
[]
[]
[]
[]
[]
[]
[]
[]
[]
[]
[]
[]
[]
[]
[]
[]
[]
[]
[]
[]
[]
[]
[]
[]
[]
[]
[]
[]
[]
[]
[]
[]
[]
[]
[null,"Nix pille!"]
[]
[null,"Figuren",null,null,null,null,"Figur jordbearbejdning mv.",null,null,null,"Figur Høst"]
[null,"Afgrøde","DB I","DBII",null,null,null,{"$f":"F217","v":""},{"$f":"I217","v":""},null,null,{"$f":"F217","v":""},{"$f":"I217","v":""}]
[null,{"$f":"F151","v":""},{"$f":"D167","v":""},{"$f":"D173","v":""},null,null,"Forår",{"$f":"D479","v":""},{"$f":"H479","v":""},null,"Juli",{"$f":"D506","v":""},{"$f":"H506","v":""}]
[null,{"$f":"I151","v":""},{"$f":"H167","v":""},{"$f":"H173","v":""},null,null,"August",{"$f":"D480","v":""},{"$f":"H480","v":""},null,"August",{"$f":"D507","v":""},{"$f":"H507","v":""}]
[null,{"$f":"M151","v":""},{"$f":"L167","v":""},{"$f":"L173","v":""},null,null,"September",{"$f":"D481","v":""},{"$f":"H481","v":""},null,"September",{"$f":"D508","v":""},{"$f":"H508","v":""}]
[null,{"$f":"R151","v":0},{"$f":"R167","v":0},{"$f":"R173","v":0},null,null,"Vinter",{"$f":"D482","v":""},{"$f":"H482","v":""},null,"Oktober",{"$f":"D509","v":""},{"$f":"H509","v":""}]
[]
[]
[]
[null,"Beregning af gødningsomkostning"]
[null,"N gødningsbehov, kr",null,{"$f":"IF(Afgnr>1,VLOOKUP(Afgnr,_Afg07,Nnr)*Npris,0)","v":0},null,null,null,{"$f":"IF(Alt1nr>1,VLOOKUP(Alt1nr,_Afg07,Nnr)*Npris,0)","v":0},null,null,null,{"$f":"IF(Alt2nr>1,VLOOKUP(Alt2nr,_Afg07,Nnr)*Npris,0)","v":0}]
[null,"N i husdyrgødning, kr.",null,{"$f":"IF(Hdgnr>1,VLOOKUP(Hdgnr,_Hdg2,4)*Npris,0)","v":0},null,null,null,{"$f":"IF(Hdgnr>1,VLOOKUP(Hdgnr,_Hdg2,4)*Npris,0)","v":0},null,null,null,{"$f":"IF(Hdgnr>1,VLOOKUP(Hdgnr,_Hdg2,4)*Npris,0)","v":0}]
[null,"N gødningsomkostning, kr.",null,{"$f":"IF(D559-D560<0,0,D559-D560)","v":0},null,null,null,{"$f":"IF(H559-H560<0,0,H559-H560)","v":0},null,null,null,{"$f":"IF(L559-L560<0,0,L559-L560)","v":0}]
[]
[null,"P startgødningsbehov1, kr.",null,{"$f":"IF(Afgnr>1,VLOOKUP(Afgnr,_Afg07,$AU$285)*Ppris,0)","v":0},null,null,null,{"$f":"IF(Alt1nr>1,VLOOKUP(Alt1nr,_Afg07,$AU$285)*Ppris,0)","v":0},null,null,null,{"$f":"IF(Alt2nr>1,VLOOKUP(Alt2nr,_Afg07,$AU$285)*Ppris,0)","v":0}]
[null,"P startgødningsbehov2, kr.",null,{"$f":"IF(Afgnr>1,VLOOKUP(Afgnr,_Afg07,$AV$285)*Ppris,0)","v":0},null,null,null,{"$f":"IF(Alt1nr>1,VLOOKUP(Alt1nr,_Afg07,$AV$285)*Ppris,0)","v":0},null,null,null,{"$f":"IF(Alt2nr>1,VLOOKUP(Alt2nr,_Afg07,$AV$285)*Ppris,0)","v":0}]
[null,"P-bortførsel-kerne, kr",null,{"$f":"IF(Afgnr>1,D152*VLOOKUP(Afgnr,_Afg07,$AW$285)*Ppris,0)","v":0},null,null,null,{"$f":"IF(Alt1nr>1,H152*VLOOKUP(Alt1nr,_Afg07,$AW$285)*Ppris,0)","v":0},null,null,null,{"$f":"IF(Alt2nr>1,L152*VLOOKUP(Alt2nr,_Afg07,$AW$285)*Ppris,0)","v":0}]
[null,"P-bortførsel-halm, kr.",null,{"$f":"IF(ISERROR(IF(AND(Afgnr>1,HalmJa=1),VLOOKUP(Afgnr,_Afg07,Halmnr)*VLOOKUP(Afgnr,_Afg07,$AX$285)*0.01*Ppris,0)),0,IF(AND(Afgnr>1,HalmJa=1),VLOOKUP(Afgnr,_Afg07,Halmnr)*VLOOKUP(Afgnr,_Afg07,$AX$285)*0.01*Ppris,0))","v":0},null,null,null,{"$f":"IF(ISERROR(IF(AND(Alt1nr>1,HalmJa=1),VLOOKUP(Alt1nr,_Afg07,Halmnr)*VLOOKUP(Alt1nr,_Afg07,$AX$285)*0.01*Ppris,0)),0,IF(AND(Alt1nr>1,HalmJa=1),VLOOKUP(Alt1nr,_Afg07,Halmnr)*VLOOKUP(Alt1nr,_Afg07,$AX$285)*0.01*Ppris,0))","v":0},null,null,null,{"$f":"IF(ISERROR(IF(AND(Alt2nr>1,HalmJa=1),VLOOKUP(Alt2nr,_Afg07,Halmnr)*VLOOKUP(Alt2nr,_Afg07,$AX$285)*0.01*Ppris,0)),0,IF(AND(Alt2nr>1,HalmJa=1),VLOOKUP(Alt2nr,_Afg07,Halmnr)*VLOOKUP(Alt2nr,_Afg07,$AX$285)*0.01*Ppris,0))","v":0}]
[null,"P i husdyrgødning, kr.",null,{"$f":"IF(Hdgnr>1,VLOOKUP(Hdgnr,_Hdg2,5)*Ppris,0)","v":0},null,null,null,{"$f":"IF(Hdgnr>1,VLOOKUP(Hdgnr,_Hdg2,5)*Ppris,0)","v":0},null,null,null,{"$f":"IF(Hdgnr>1,VLOOKUP(Hdgnr,_Hdg2,5)*Ppris,0)","v":0}]
[null,"P gødningsomkostning, kr.",null,{"$f":"D563+IF((D564+D565+D566)>D567,(D564+D565+D566)-D567,0)","v":0},null,null,null,{"$f":"H563+IF((H564+H565+H566)>H567,(H564+H565+H566)-H567,0)","v":0},null,null,null,{"$f":"L563+IF((L564+L565+L566)>L567,(L564+L565+L566)-L567,0)","v":0}]
[]
[null,"K startgødningsbehov, kr.",null,{"$f":"IF(AND(Afgnr>1,OR(CU5=1,CU5=3)),VLOOKUP(Afgnr,_Afg07,$AY$285)*Kpris,0)","v":0},null,null,null,{"$f":"IF(AND(Alt1nr>1,OR(CU5=1,CU5=3)),VLOOKUP(Alt1nr,_Afg07,$AY$285)*Kpris,0)","v":0},null,null,null,{"$f":"IF(AND(Alt2nr>1,OR(CU5=1,CU5=3)),VLOOKUP(Alt2nr,_Afg07,$AY$285)*Kpris,0)","v":0}]
[null,"K-bortførsel-kerne, kr",null,{"$f":"IF(Afgnr>1,D152*VLOOKUP(Afgnr,_Afg07,$AZ$285)*Kpris,0)","v":0},null,null,null,{"$f":"IF(Alt1nr>1,H152*VLOOKUP(Alt1nr,_Afg07,$AZ$285)*Kpris,0)","v":0},null,null,null,{"$f":"IF(Alt2nr>1,L152*VLOOKUP(Alt2nr,_Afg07,$AZ$285)*Kpris,0)","v":0}]
[null,"K-bortførsel-halm, kr.",null,{"$f":"IF(ISERROR(IF(AND(Afgnr>1,HalmJa=1),VLOOKUP(Afgnr,_Afg07,Halmnr)*VLOOKUP(Afgnr,_Afg07,$BA$285)*0.01*Kpris,0)),0,IF(AND(Afgnr>1,HalmJa=1),VLOOKUP(Afgnr,_Afg07,Halmnr)*VLOOKUP(Afgnr,_Afg07,$BA$285)*0.01*Kpris,0))","v":0},null,null,null,{"$f":"IF(ISERROR(IF(AND(Alt1nr>1,HalmJa=1),VLOOKUP(Alt1nr,_Afg07,Halmnr)*VLOOKUP(Alt1nr,_Afg07,$BA$285)*0.01*Kpris,0)),0,IF(AND(Alt1nr>1,HalmJa=1),VLOOKUP(Alt1nr,_Afg07,Halmnr)*VLOOKUP(Alt1nr,_Afg07,$BA$285)*0.01*Kpris,0))","v":0},null,null,null,{"$f":"IF(ISERROR(IF(AND(Alt2nr>1,HalmJa=1),VLOOKUP(Alt2nr,_Afg07,Halmnr)*VLOOKUP(Alt2nr,_Afg07,$BA$285)*0.01*Kpris,0)),0,IF(AND(Alt2nr>1,HalmJa=1),VLOOKUP(Alt2nr,_Afg07,Halmnr)*VLOOKUP(Alt2nr,_Afg07,$BA$285)*0.01*Kpris,0))","v":0}]
[null,"K i husdyrgødning, kr.",null,{"$f":"IF(Hdgnr>1,VLOOKUP(Hdgnr,_Hdg2,6)*Kpris,0)","v":0},null,null,null,{"$f":"IF(Hdgnr>1,VLOOKUP(Hdgnr,_Hdg2,6)*Kpris,0)","v":0},null,null,null,{"$f":"IF(Hdgnr>1,VLOOKUP(Hdgnr,_Hdg2,6)*Kpris,0)","v":0}]
[null,"K gødningsomkostning, kr.",null,{"$f":"D569+IF((D570+D571+D572)>D573,(D570+D571+D572)-D573,0)","v":0},null,null,null,{"$f":"H569+IF((H570+H571+H572)>H573,(H570+H571+H572)-H573,0)","v":0},null,null,null,{"$f":"L569+IF((L570+L571+L572)>L573,(L570+L571+L572)-L573,0)","v":0}]
[]
[null,"Gødning i alt, kr",null,{"$f":"IF(ISERROR(D561+D568+D574),0,(D561+D568+D574))","v":0},null,null,null,{"$f":"IF(ISERROR(H561+H568+H574),0,(H561+H568+H574))","v":0},null,null,null,{"$f":"IF(ISERROR(L561+L568+L574),0,(L561+L568+L574))","v":0}]
[]
[null,"Udgifter foderkorn"]
[null,"Udsæd",null,{"$f":"IF(Afgnr>1,IF(VLOOKUP(Afgnr,_Afg07,$BU$285)=1,VLOOKUP(Afgnr,_Afg07,$AL$285),IF(VLOOKUP(Afgnr,_Afg07,$BU$285)=3,VLOOKUP(1,Foderkorn,$AL$285),IF(VLOOKUP(Afgnr,_Afg07,$BU$285)=4,VLOOKUP(2,Foderkorn,$AL$285),0))),0)","v":0},null,null,null,{"$f":"IF(Alt1nr>1,IF(VLOOKUP(Alt1nr,_Afg07,$BU$285)=1,VLOOKUP(Alt1nr,_Afg07,$AL$285),IF(VLOOKUP(Alt1nr,_Afg07,$BU$285)=3,VLOOKUP(1,Foderkorn,$AL$285),IF(VLOOKUP(Alt1nr,_Afg07,$BU$285)=4,VLOOKUP(2,Foderkorn,$AL$285),0))),0)","v":0},null,null,null,{"$f":"IF(Alt2nr>1,IF(VLOOKUP(Alt2nr,_Afg07,$BU$285)=1,VLOOKUP(Alt1nr,_Afg07,$AL$285),IF(VLOOKUP(Alt2nr,_Afg07,$BU$285)=3,VLOOKUP(1,Foderkorn,$AL$285),IF(VLOOKUP(Alt2nr,_Afg07,$BU$285)=4,VLOOKUP(2,Foderkorn,$AL$285),0))),0)","v":0}]
[null,"Planteværn",null,{"$f":"IF(Afgnr>1,IF(VLOOKUP(Afgnr,_Afg07,$BU$285)=1,VLOOKUP(Afgnr,_Afg07,$AM$285),IF(VLOOKUP(Afgnr,_Afg07,$BU$285)=3,VLOOKUP(1,Foderkorn,$AM$285),IF(VLOOKUP(Afgnr,_Afg07,$BU$285)=4,VLOOKUP(2,Foderkorn,$AM$285),0))),0)","v":0},null,null,null,{"$f":"IF(Alt1nr>1,IF(VLOOKUP(Alt1nr,_Afg07,$BU$285)=1,VLOOKUP(Alt1nr,_Afg07,$AM$285),IF(VLOOKUP(Alt1nr,_Afg07,$BU$285)=3,VLOOKUP(1,Foderkorn,$AM$285),IF(VLOOKUP(Alt1nr,_Afg07,$BU$285)=4,VLOOKUP(2,Foderkorn,$AM$285),0))),0)","v":0},null,null,null,{"$f":"IF(Alt2nr>1,IF(VLOOKUP(Alt2nr,_Afg07,$BU$285)=1,VLOOKUP(Alt2nr,_Afg07,$AM$285),IF(VLOOKUP(Alt2nr,_Afg07,$BU$285)=3,VLOOKUP(1,Foderkorn,$AM$285),IF(VLOOKUP(Alt2nr,_Afg07,$BU$285)=4,VLOOKUP(2,Foderkorn,$AM$285),0))),0)","v":0}]
[]
[null,"N gødningsbehov, kr (foderkorn)",null,{"$f":"IF(Afgnr>1,IF(VLOOKUP(Afgnr,_Afg07,$BU$285)=1,VLOOKUP(Afgnr,_Afg07,Nnr)*Npris,IF(VLOOKUP(Afgnr,_Afg07,$BU$285)=3,VLOOKUP(1,Foderkorn,Nnr)*Npris,IF(VLOOKUP(Afgnr,_Afg07,$BU$285)=4,VLOOKUP(2,Foderkorn,Nnr)*Npris,0))),0)","v":0},null,null,null,{"$f":"IF(Alt1nr>1,IF(VLOOKUP(Alt1nr,_Afg07,$BU$285)=1,VLOOKUP(Alt1nr,_Afg07,Nnr)*Npris,IF(VLOOKUP(Alt1nr,_Afg07,$BU$285)=3,VLOOKUP(1,Foderkorn,Nnr)*Npris,IF(VLOOKUP(Alt1nr,_Afg07,$BU$285)=4,VLOOKUP(2,Foderkorn,Nnr)*Npris,0))),0)","v":0},null,null,null,{"$f":"IF(Alt2nr>1,IF(VLOOKUP(Alt2nr,_Afg07,$BU$285)=1,VLOOKUP(Alt2nr,_Afg07,Nnr)*Npris,IF(VLOOKUP(Alt2nr,_Afg07,$BU$285)=3,VLOOKUP(1,Foderkorn,Nnr)*Npris,IF(VLOOKUP(Alt2nr,_Afg07,$BU$285)=4,VLOOKUP(2,Foderkorn,Nnr)*Npris,0))),0)","v":0}]
[null,"N i husdyrgødning, kr.",null,{"$f":"IF(Hdgnr>1,VLOOKUP(Hdgnr,_Hdg2,4)*Npris,0)","v":0},null,null,null,{"$f":"IF(Hdgnr>1,VLOOKUP(Hdgnr,_Hdg2,4)*Npris,0)","v":0},null,null,null,{"$f":"IF(Hdgnr>1,VLOOKUP(Hdgnr,_Hdg2,4)*Npris,0)","v":0}]
[null,"N gødningsomkostning, kr.",null,{"$f":"IF(D582-D583<0,0,D582-D583)","v":0},null,null,null,{"$f":"IF(H582-H583<0,0,H582-H583)","v":0},null,null,null,{"$f":"IF(L582-L583<0,0,L582-L583)","v":0}]
[]
[null,"P startgødningsbehov1, kr.",null,{"$f":"IF(Afgnr>1,IF(VLOOKUP(Afgnr,_Afg07,$BU$285)=1,VLOOKUP(Afgnr,_Afg07,$AU$285)*Ppris,IF(VLOOKUP(Afgnr,_Afg07,$BU$285)=3,VLOOKUP(1,Foderkorn,$AU$285)*Ppris,IF(VLOOKUP(Afgnr,_Afg07,$BU$285)=4,VLOOKUP(2,Foderkorn,$AU$285)*Ppris,0))),0)","v":0},null,null,null,{"$f":"IF(Alt1nr>1,IF(VLOOKUP(Alt1nr,_Afg07,$BU$285)=1,VLOOKUP(Alt1nr,_Afg07,$AU$285)*Ppris,IF(VLOOKUP(Alt1nr,_Afg07,$BU$285)=3,VLOOKUP(1,Foderkorn,$AU$285)*Ppris,IF(VLOOKUP(Alt1nr,_Afg07,$BU$285)=4,VLOOKUP(2,Foderkorn,$AU$285)*Ppris,0))),0)","v":0},null,null,null,{"$f":"IF(Alt2nr>1,IF(VLOOKUP(Alt2nr,_Afg07,$BU$285)=1,VLOOKUP(Alt2nr,_Afg07,$AU$285)*Ppris,IF(VLOOKUP(Alt2nr,_Afg07,$BU$285)=3,VLOOKUP(1,Foderkorn,$AU$285)*Ppris,IF(VLOOKUP(Alt2nr,_Afg07,$BU$285)=4,VLOOKUP(2,Foderkorn,$AU$285)*Ppris,0))),0)","v":0}]
[null,"P startgødningsbehov2, kr.",null,{"$f":"IF(Afgnr>1,IF(VLOOKUP(Afgnr,_Afg07,$BU$285)=1,VLOOKUP(Afgnr,_Afg07,$AV$285)*Ppris,IF(VLOOKUP(Afgnr,_Afg07,$BU$285)=3,VLOOKUP(1,Foderkorn,$AV$285)*Ppris,IF(VLOOKUP(Afgnr,_Afg07,$BU$285)=4,VLOOKUP(2,Foderkorn,$AV$285)*Ppris,0))),0)","v":0},null,null,null,{"$f":"IF(Alt1nr>1,IF(VLOOKUP(Alt1nr,_Afg07,$BU$285)=1,VLOOKUP(Alt1nr,_Afg07,$AV$285)*Ppris,IF(VLOOKUP(Alt1nr,_Afg07,$BU$285)=3,VLOOKUP(1,Foderkorn,$AV$285)*Ppris,IF(VLOOKUP(Alt1nr,_Afg07,$BU$285)=4,VLOOKUP(2,Foderkorn,$AV$285)*Ppris,0))),0)","v":0},null,null,null,{"$f":"IF(Alt2nr>1,IF(VLOOKUP(Alt2nr,_Afg07,$BU$285)=1,VLOOKUP(Alt2nr,_Afg07,$AV$285)*Ppris,IF(VLOOKUP(Alt2nr,_Afg07,$BU$285)=3,VLOOKUP(1,Foderkorn,$AV$285)*Ppris,IF(VLOOKUP(Alt2nr,_Afg07,$BU$285)=4,VLOOKUP(2,Foderkorn,$AV$285)*Ppris,0))),0)","v":0}]
[null,"P-bortførsel-kerne, kr",null,{"$f":"IF(Afgnr>1,IF(VLOOKUP(Afgnr,_Afg07,$BU$285)=1,D$152*VLOOKUP(Afgnr,_Afg07,$AW$285)*Ppris,IF(VLOOKUP(Afgnr,_Afg07,$BU$285)=3,$DA$173*VLOOKUP(1,Foderkorn,$AW$285)*Ppris,IF(VLOOKUP(Afgnr,_Afg07,$BU$285)=4,$DA$174*VLOOKUP(2,Foderkorn,$AW$285)*Ppris,0))),0)","v":0},null,null,null,{"$f":"IF(Alt1nr>1,IF(VLOOKUP(Alt1nr,_Afg07,$BU$285)=1,H$152*VLOOKUP(Alt1nr,_Afg07,$AW$285)*Ppris,IF(VLOOKUP(Alt1nr,_Afg07,$BU$285)=3,$DA$173*VLOOKUP(1,Foderkorn,$AW$285)*Ppris,IF(VLOOKUP(Alt1nr,_Afg07,$BU$285)=4,$DA$174*VLOOKUP(2,Foderkorn,$AW$285)*Ppris,0))),0)","v":0},null,null,null,{"$f":"IF(Alt2nr>1,IF(VLOOKUP(Alt2nr,_Afg07,$BU$285)=1,L$152*VLOOKUP(Alt2nr,_Afg07,$AW$285)*Ppris,IF(VLOOKUP(Alt2nr,_Afg07,$BU$285)=3,$DA$173*VLOOKUP(1,Foderkorn,$AW$285)*Ppris,IF(VLOOKUP(Alt2nr,_Afg07,$BU$285)=4,$DA$174*VLOOKUP(2,Foderkorn,$AW$285)*Ppris,0))),0)","v":0}]
[null,"P-bortførsel-halm, kr.",null,{"$f":"IF(AND(Afgnr>1,HalmJa=1),IF(VLOOKUP(Afgnr,_Afg07,$BU$285)=1,VLOOKUP(Afgnr,_Afg07,Halmnr)*VLOOKUP(Afgnr,_Afg07,$AX$285)*0.01*Ppris,IF(VLOOKUP(Afgnr,_Afg07,$BU$285)=3,VLOOKUP(1,Foderkorn,Halmnr)*VLOOKUP(1,Foderkorn,$AX$285)*0.01*Ppris,IF(VLOOKUP(Afgnr,_Afg07,$BU$285)=4,VLOOKUP(2,Foderkorn,Halmnr)*VLOOKUP(2,Foderkorn,$AX$285)*0.01*Ppris,0))),0)","v":0},null,null,null,{"$f":"IF(AND(Alt1nr>1,HalmJa=1),IF(VLOOKUP(Alt1nr,_Afg07,$BU$285)=1,VLOOKUP(Alt1nr,_Afg07,Halmnr)*VLOOKUP(Alt1nr,_Afg07,$AX$285)*0.01*Ppris,IF(VLOOKUP(Alt1nr,_Afg07,$BU$285)=3,VLOOKUP(1,Foderkorn,Halmnr)*VLOOKUP(1,Foderkorn,$AX$285)*0.01*Ppris,IF(VLOOKUP(Alt1nr,_Afg07,$BU$285)=4,VLOOKUP(2,Foderkorn,Halmnr)*VLOOKUP(2,Foderkorn,$AX$285)*0.01*Ppris,0))),0)","v":0},null,null,null,{"$f":"IF(AND(Alt2nr>1,HalmJa=1),IF(VLOOKUP(Alt2nr,_Afg07,$BU$285)=1,VLOOKUP(Alt2nr,_Afg07,Halmnr)*VLOOKUP(Alt2nr,_Afg07,$AX$285)*0.01*Ppris,IF(VLOOKUP(Alt2nr,_Afg07,$BU$285)=3,VLOOKUP(1,Foderkorn,Halmnr)*VLOOKUP(1,Foderkorn,$AX$285)*0.01*Ppris,IF(VLOOKUP(Alt2nr,_Afg07,$BU$285)=4,VLOOKUP(2,Foderkorn,Halmnr)*VLOOKUP(2,Foderkorn,$AX$285)*0.01*Ppris,0))),0)","v":0}]
[null,"P i husdyrgødning, kr.",null,{"$f":"IF(Hdgnr>1,VLOOKUP(Hdgnr,_Hdg2,5)*Ppris,0)","v":0},null,null,null,{"$f":"IF(Hdgnr>1,VLOOKUP(Hdgnr,_Hdg2,5)*Ppris,0)","v":0},null,null,null,{"$f":"IF(Hdgnr>1,VLOOKUP(Hdgnr,_Hdg2,5)*Ppris,0)","v":0}]
[null,"P gødningsomkostning, kr.",null,{"$f":"D586+IF((D587+D588+D589)>D590,(D587+D588+D589)-D590,0)","v":0},null,null,null,{"$f":"H586+IF((H587+H588+H589)>H590,(H587+H588+H589)-H590,0)","v":0},null,null,null,{"$f":"L586+IF((L587+L588+L589)>L590,(L587+L588+L589)-L590,0)","v":0}]
[]
[null,"K startgødningsbehov, kr.",null,{"$f":"IF(AND(Afgnr>1,OR($CU$5=1,$CU$5=3)),IF(VLOOKUP(Afgnr,_Afg07,$BU$285)=1,VLOOKUP(Afgnr,_Afg07,$AY$285)*Kpris,IF(VLOOKUP(Afgnr,_Afg07,$BU$285)=3,VLOOKUP(1,Foderkorn,$AY$285)*Kpris,IF(VLOOKUP(Afgnr,_Afg07,$BU$285)=4,VLOOKUP(2,Foderkorn,$AY$285)*Kpris,0))),0)","v":0},null,null,null,{"$f":"IF(AND(Alt1nr>1,OR($CU$5=1,$CU$5=3)),IF(VLOOKUP(Alt1nr,_Afg07,$BU$285)=1,VLOOKUP(Alt1nr,_Afg07,$AY$285)*Kpris,IF(VLOOKUP(Alt1nr,_Afg07,$BU$285)=3,VLOOKUP(1,Foderkorn,$AY$285)*Kpris,IF(VLOOKUP(Alt1nr,_Afg07,$BU$285)=4,VLOOKUP(2,Foderkorn,$AY$285)*Kpris,0))),0)","v":0},null,null,null,{"$f":"IF(AND(Alt2nr>1,OR($CU$5=1,$CU$5=3)),IF(VLOOKUP(Alt2nr,_Afg07,$BU$285)=1,VLOOKUP(Alt2nr,_Afg07,$AY$285)*Kpris,IF(VLOOKUP(Alt2nr,_Afg07,$BU$285)=3,VLOOKUP(1,Foderkorn,$AY$285)*Kpris,IF(VLOOKUP(Alt2nr,_Afg07,$BU$285)=4,VLOOKUP(2,Foderkorn,$AY$285)*Kpris,0))),0)","v":0}]
[null,"K-bortførsel-kerne, kr",null,{"$f":"IF(Afgnr>1,IF(VLOOKUP(Afgnr,_Afg07,$BU$285)=1,D$152*VLOOKUP(Afgnr,_Afg07,$AZ$285)*Kpris,IF(VLOOKUP(Afgnr,_Afg07,$BU$285)=3,$DA$173*VLOOKUP(1,Foderkorn,$AZ$285)*Kpris,IF(VLOOKUP(Afgnr,_Afg07,$BU$285)=4,$DA$174*VLOOKUP(2,Foderkorn,$AZ$285)*Kpris,0))),0)","v":0},null,null,null,{"$f":"IF(Alt1nr>1,IF(VLOOKUP(Alt1nr,_Afg07,$BU$285)=1,H$152*VLOOKUP(Alt1nr,_Afg07,$AZ$285)*Kpris,IF(VLOOKUP(Alt1nr,_Afg07,$BU$285)=3,$DA$173*VLOOKUP(1,Foderkorn,$AZ$285)*Kpris,IF(VLOOKUP(Alt1nr,_Afg07,$BU$285)=4,$DA$174*VLOOKUP(2,Foderkorn,$AZ$285)*Kpris,0))),0)","v":0},null,null,null,{"$f":"IF(Alt2nr>1,IF(VLOOKUP(Alt2nr,_Afg07,$BU$285)=1,L$152*VLOOKUP(Alt2nr,_Afg07,$AZ$285)*Kpris,IF(VLOOKUP(Alt2nr,_Afg07,$BU$285)=3,$DA$173*VLOOKUP(1,Foderkorn,$AZ$285)*Kpris,IF(VLOOKUP(Alt2nr,_Afg07,$BU$285)=4,$DA$174*VLOOKUP(2,Foderkorn,$AZ$285)*Kpris,0))),0)","v":0}]
[null,"K-bortførsel-halm, kr.",null,{"$f":"IF(AND(Afgnr>1,HalmJa=1),IF(VLOOKUP(Afgnr,_Afg07,$BU$285)=1,VLOOKUP(Afgnr,_Afg07,Halmnr)*VLOOKUP(Afgnr,_Afg07,$BA$285)*0.01*Kpris,IF(VLOOKUP(Afgnr,_Afg07,$BU$285)=3,VLOOKUP(1,Foderkorn,Halmnr)*VLOOKUP(1,Foderkorn,$BA$285)*0.01*Kpris,IF(VLOOKUP(Afgnr,_Afg07,$BU$285)=4,VLOOKUP(2,Foderkorn,Halmnr)*VLOOKUP(2,Foderkorn,$BA$285)*0.01*Kpris,0))),0)","v":0},null,null,null,{"$f":"IF(AND(Alt1nr>1,HalmJa=1),IF(VLOOKUP(Alt1nr,_Afg07,$BU$285)=1,VLOOKUP(Alt1nr,_Afg07,Halmnr)*VLOOKUP(Alt1nr,_Afg07,$BA$285)*0.01*Kpris,IF(VLOOKUP(Alt1nr,_Afg07,$BU$285)=3,VLOOKUP(1,Foderkorn,Halmnr)*VLOOKUP(1,Foderkorn,$BA$285)*0.01*Kpris,IF(VLOOKUP(Alt1nr,_Afg07,$BU$285)=4,VLOOKUP(2,Foderkorn,Halmnr)*VLOOKUP(2,Foderkorn,$BA$285)*0.01*Kpris,0))),0)","v":0},null,null,null,{"$f":"IF(AND(Alt2nr>1,HalmJa=1),IF(VLOOKUP(Alt2nr,_Afg07,$BU$285)=1,VLOOKUP(Alt2nr,_Afg07,Halmnr)*VLOOKUP(Alt2nr,_Afg07,$BA$285)*0.01*Kpris,IF(VLOOKUP(Alt2nr,_Afg07,$BU$285)=3,VLOOKUP(1,Foderkorn,Halmnr)*VLOOKUP(1,Foderkorn,$BA$285)*0.01*Kpris,IF(VLOOKUP(Alt2nr,_Afg07,$BU$285)=4,VLOOKUP(2,Foderkorn,Halmnr)*VLOOKUP(2,Foderkorn,$BA$285)*0.01*Kpris,0))),0)","v":0}]
[null,"K i husdyrgødning, kr.",null,{"$f":"IF(Hdgnr>1,VLOOKUP(Hdgnr,_Hdg2,6)*Kpris,0)","v":0},null,null,null,{"$f":"IF(Hdgnr>1,VLOOKUP(Hdgnr,_Hdg2,6)*Kpris,0)","v":0},null,null,null,{"$f":"IF(Hdgnr>1,VLOOKUP(Hdgnr,_Hdg2,6)*Kpris,0)","v":0}]
[null,"K gødningsomkostning, kr.",null,{"$f":"D592+IF((D593+D594+D595)>D596,(D593+D594+D595)-D596,0)","v":0},null,null,null,{"$f":"H592+IF((H593+H594+H595)>H596,(H593+H594+H595)-H596,0)","v":0},null,null,null,{"$f":"L592+IF((L593+L594+L595)>L596,(L593+L594+L595)-L596,0)","v":0}]
[]
[null,"Gødning i alt, kr",null,{"$f":"IF(ISERROR(D584+D591+D597),0,(D584+D591+D597))","v":0},null,null,null,{"$f":"IF(ISERROR(H584+H591+H597),0,(H584+H591+H597))","v":0},null,null,null,{"$f":"IF(ISERROR(L584+L591+L597),0,(L584+L591+L597))","v":0}]
[]
[null,"Diverse styk",null,{"$f":"IF(Afgnr>1,IF(VLOOKUP(Afgnr,_Afg07,$BU$285)=1,VLOOKUP(Afgnr,_Afg07,$AN$285)+D$152*VLOOKUP(Afgnr,_Afg07,$BB$285),IF(VLOOKUP(Afgnr,_Afg07,$BU$285)=3,VLOOKUP(1,Foderkorn,$AN$285)+$DA$173*VLOOKUP(1,Foderkorn,$BB$285),IF(VLOOKUP(Afgnr,_Afg07,$BU$285)=4,VLOOKUP(2,Foderkorn,$AN$285)+$DA$174*VLOOKUP(2,Foderkorn,$BB$285),0))),0)","v":0},null,null,null,{"$f":"IF(Alt1nr>1,IF(VLOOKUP(Alt1nr,_Afg07,$BU$285)=1,VLOOKUP(Alt1nr,_Afg07,$AN$285)+H$152*VLOOKUP(Alt1nr,_Afg07,$BB$285),IF(VLOOKUP(Alt1nr,_Afg07,$BU$285)=3,VLOOKUP(1,Foderkorn,$AN$285)+$DA$173*VLOOKUP(1,Foderkorn,$BB$285),IF(VLOOKUP(Alt1nr,_Afg07,$BU$285)=4,VLOOKUP(2,Foderkorn,$AN$285)+$DA$174*VLOOKUP(2,Foderkorn,$BB$285),0))),0)","v":0},null,null,null,{"$f":"IF(Alt2nr>1,IF(VLOOKUP(Alt2nr,_Afg07,$BU$285)=1,VLOOKUP(Alt2nr,_Afg07,$AN$285)+L$152*VLOOKUP(Alt2nr,_Afg07,$BB$285),IF(VLOOKUP(Alt2nr,_Afg07,$BU$285)=3,VLOOKUP(1,Foderkorn,$AN$285)+$DA$173*VLOOKUP(1,Foderkorn,$BB$285),IF(VLOOKUP(Alt2nr,_Afg07,$BU$285)=4,VLOOKUP(2,Foderkorn,$AN$285)+$DA$174*VLOOKUP(2,Foderkorn,$BB$285),0))),0)","v":0}]
[]
[null,"Maskiner og arbejde",null,{"$f":"IF(Afgnr>1,IF(VLOOKUP(Afgnr,_Afg07,$BU$285)=1,VLOOKUP(Afgnr,_Afg07,$CW$7),IF(VLOOKUP(Afgnr,_Afg07,$BU$285)=3,VLOOKUP(1,Foderkorn,$CW$7),IF(VLOOKUP(Afgnr,_Afg07,$BU$285)=4,VLOOKUP(2,Foderkorn,$CW$7),0))),0)","v":0},null,null,null,{"$f":"IF(Alt1nr>1,IF(VLOOKUP(Alt1nr,_Afg07,$BU$285)=1,VLOOKUP(Alt1nr,_Afg07,$CW$7),IF(VLOOKUP(Alt1nr,_Afg07,$BU$285)=3,VLOOKUP(1,Foderkorn,$CW$7),IF(VLOOKUP(Alt1nr,_Afg07,$BU$285)=4,VLOOKUP(2,Foderkorn,$CW$7),0))),0)","v":0},null,null,null,{"$f":"IF(Alt2nr>1,IF(VLOOKUP(Alt2nr,_Afg07,$BU$285)=1,VLOOKUP(Alt2nr,_Afg07,$CW$7),IF(VLOOKUP(Alt2nr,_Afg07,$BU$285)=3,VLOOKUP(1,Foderkorn,$CW$7),IF(VLOOKUP(Alt2nr,_Afg07,$BU$285)=4,VLOOKUP(2,Foderkorn,$CW$7),0))),0)","v":0}]
[]
[null,"Tørring",null,{"$f":"IF(AND(Afgnr>1,$CX$5<>4),IF(VLOOKUP(Afgnr,_Afg07,$BU$285)=1,VLOOKUP(Afgnr,_Afg07,Tørrenr)*D$152,IF(VLOOKUP(Afgnr,_Afg07,$BU$285)=3,VLOOKUP(1,Foderkorn,Tørrenr)*$DA$173,IF(VLOOKUP(Afgnr,_Afg07,$BU$285)=4,VLOOKUP(2,Foderkorn,Tørrenr)*$DA$174,))),0)","v":0},null,null,null,{"$f":"IF(AND(Alt1nr>1,$CX$5<>4),IF(VLOOKUP(Alt1nr,_Afg07,$BU$285)=1,VLOOKUP(Alt1nr,_Afg07,Tørrenr)*H$152,IF(VLOOKUP(Alt1nr,_Afg07,$BU$285)=3,VLOOKUP(1,Foderkorn,Tørrenr)*$DA$173,IF(VLOOKUP(Alt1nr,_Afg07,$BU$285)=4,VLOOKUP(2,Foderkorn,Tørrenr)*$DA$174,))),0)","v":0},null,null,null,{"$f":"IF(AND(Alt2nr>1,$CX$5<>4),IF(VLOOKUP(Alt2nr,_Afg07,$BU$285)=1,VLOOKUP(Alt2nr,_Afg07,Tørrenr)*L$152,IF(VLOOKUP(Alt2nr,_Afg07,$BU$285)=3,VLOOKUP(1,Foderkorn,Tørrenr)*$DA$173,IF(VLOOKUP(Alt2nr,_Afg07,$BU$285)=4,VLOOKUP(2,Foderkorn,Tørrenr)*$DA$174,))),0)","v":0}]
[]
[null,"Alle omkostninger, foderkorn",null,{"$f":"D579+D580+D599+D601+D603+D605","v":0},null,null,null,{"$f":"H579+H580+H599+H601+H603+H605","v":0},null,null,null,{"$f":"L579+L580+L599+L601+L603+L605","v":0}]

{"sheet":"Ark2","index":2,"n_rows":373,"n_cols":50,"rows_kept":373,"cut":false,"hidden":false,"merged":[[342,9,342,10],[344,9,344,10],[327,6,327,7],[327,9,327,10],[319,9,319,10],[329,9,329,10],[340,9,340,10],[321,6,321,7],[323,6,323,7],[323,9,323,10],[325,6,325,7],[325,9,325,10],[321,9,321,10],[319,6,319,7],[61,18,62,26],[315,6,315,7],[315,9,315,10],[313,9,313,10],[276,0,278,0],[281,0,283,0],[286,0,288,0],[291,0,293,0],[296,0,298,0],[301,0,303,0],[243,0,245,0],[248,0,250,0],[253,0,255,0],[258,0,260,0],[271,0,273,0],[66,0,68,0],[223,2,223,8],[160,9,160,10],[185,7,187,12],[205,7,207,12],[86,11,87,16],[91,11,92,16],[107,11,108,16],[112,11,113,16],[317,6,317,7],[317,9,317,10],[301,7,303,12],[291,7,293,12],[276,7,278,12],[281,7,283,12],[286,7,288,12],[296,7,298,12],[233,7,235,12],[238,7,240,12],[266,2,266,8],[243,7,245,12],[248,7,250,12],[253,7,255,12],[258,7,260,12],[271,7,273,12],[362,4,362,5],[364,4,364,5],[366,4,366,5],[368,4,368,5],[370,4,370,5],[372,4,372,5],[127,0,129,0],[132,0,134,0],[137,0,139,0],[185,0,187,0],[190,0,192,0],[195,0,197,0],[200,0,202,0],[205,0,207,0],[180,2,180,8],[190,7,192,12],[210,0,212,0],[215,0,217,0],[228,0,230,0],[233,0,235,0],[238,0,240,0],[313,6,313,7],[215,7,217,12],[228,7,230,12],[372,7,372,8],[364,10,364,11],[366,10,366,11],[368,10,368,11],[370,10,370,11],[372,10,372,11],[362,10,362,11],[362,7,362,8],[364,7,364,8],[366,7,366,8],[368,7,368,8],[370,7,370,8],[0,0,0,16],[5,18,18,26],[195,7,197,12],[71,0,73,0],[76,0,78,0],[81,0,83,0],[86,0,88,0],[91,0,93,0],[50,0,51,1],[4,0,5,1],[15,0,17,0],[20,0,22,0],[61,0,63,0],[15,11,16,16],[20,11,21,16],[25,11,26,16],[30,11,31,16],[35,11,36,16],[25,0,27,0],[30,0,32,0],[35,0,37,0],[40,0,42,0],[45,0,47,0],[7,2,7,8],[210,7,212,12],[96,0,97,1],[107,0,109,0],[112,0,114,0],[117,0,119,0],[122,0,124,0],[71,11,72,16],[117,11,118,16],[148,9,148,10],[127,11,128,16],[132,11,133,16],[137,11,138,16],[158,9,158,10],[146,6,146,7],[148,6,148,7],[150,6,150,7],[152,6,152,7],[154,6,154,7],[156,6,156,7],[156,9,156,10],[150,9,150,10],[152,9,152,10],[154,9,154,10],[99,2,99,8],[76,11,77,16],[81,11,82,16],[61,11,62,16],[66,11,67,16],[40,11,41,16],[45,11,46,16],[200,7,202,12],[122,11,123,16],[158,6,158,7],[146,9,146,10],[160,6,160,7],[53,2,53,8]]}
["Sædskifteplan m. foderproduktion. Foderbehov (korn)."]
[]
["Bemærk at nedenstående beregninger tager ikke hensyn til \"Egen afgrøde\""]
[]
["Delsædskifte 1"]
[null,null,null,null,null,null,null,null,null,null,null,null,null,null,null,null,null,null,"Dette regneark kan anvendes til at udarbejde en sædskifteplan med op til 3 delsædskifter.\n\nFoderproduktionen (korn til svin) bliver beregnet ud fra sædskifteplanen.\n\nI regnearket kan man endvidere beregne foderbehovet (korn til svin). Foderbehovet fordeles på kornarter.\n\nDu kan angive både afgrøder og efterafgrøde.\nMan kan også dele arealet melem 2 afgrøder.\n"]
[]
[null,"Marker/ejendomme:",null,null,null,null,null,null,null,null,null,null,null,null,null,null,null,null,null,null,null,null,null,null,null,null,null,null,null,null,null,null,"Udbyttenr2"]
[]
[null,"Jordtype",null,null,null,null,null,null,null,null,null,null,null,null,null,null,null,null,null,null,null,null,null,null,null,null,null,null,null,null,null,4,{"$f":"IF(AF10=1,5,IF(AF10=2,6,IF(AF10=3,7,IF(AF10=4,8,IF(AF10=5,9,\"\")))))","v":8},"Areal",null,null,null,null,"Database"]
[null,null,null,null,null,null,null,null,null,null,null,null,null,null,null,null,null,null,null,null,null,null,null,null,null,null,null,null,null,null,null,null,null,"til fordeling","Fordelt_areal"]
[null,"Samlet areal",null,"ha",null,null,null,null,null,null,null,null,null,null,null,null,null,null,null,null,null,null,null,null,null,null,null,null,null,null,null,null,null,{"$f":"C12-AH50","v":0},{"$f":"Areal_fordel/Antal_skifter","v":{"$error":"#DIV/0!"}}]
[]
["Afgrødefølge",null,"  Areal",null,null,null," Udbytte pr. ha",null,null,null,null,"Kommentarer",null,null,null,null,null,null,null,null,null,null,null,null,null,null,null,null,null,null,null,null,"Antal","Areal","Efter-","Areal",null,null,"Afgnr","Areal","Udbyt_ha","Udbyt_alt","Efterafgrøde"]
[null,null,null,null,null,null,null,null,null,null,null,null,null,null,null,null,null,null,null,null,null,null,null,null,null,null,null,null,null,null,"Afgrødefølge",null,"skifter","indtastet","afgrøde","indtastet efterafgrøde"]
[1,null,{"$f":"IF(E16>0,\"\",IF(AND(AF16>1,AF18>1,AI16+AI18=0),Fordelt_areal/2,IF(AF16>1,Fordelt_areal,\"\")))","v":""},{"$f":"IF(C16<>\"\",\"ha\",\"\")","v":""},null,"ha",{"$f":"IF(I16<>\"\",\"\",IF(VLOOKUP(AF16,_Afg07,Udbyttenr2)=0,\"\",VLOOKUP(AF16,_Afg07,Udbyttenr2)))","v":""},{"$f":"IF(G16=\"\",\"\",IF(AF16>1,IF(VLOOKUP(AF16,_Afg07,3)<>\"\",VLOOKUP(AF16,_Afg07,3),\"\"),\"\"))","v":""},null,"hkg",null,null,null,null,null,null,null,null,null,null,null,null,null,null,null,null,null,null,null,null,{"$f":"A16","v":1},1,{"$f":"IF(AND(AF16>1,AH16=0),1,0)","v":0},{"$f":"IF(AND(E16<>\"\",VLOOKUP(AF16,_Afg07,3)<>\"\"),E16,0)","v":0},{"$f":"IF(AND(AF16>1,VLOOKUP(AF16,_Afg07,3)=\"\"),1,0)","v":0},{"$f":"IF(AND(E16<>\"\",AF16>1,VLOOKUP(AF16,_Afg07,3)=\"\"),E16,0)","v":0},null,null,{"$f":"AF16","v":1},{"$f":"IF(E16<>\"\",E16,C16)","v":""},{"$f":"IF(I16<>\"\",I16,G16)","v":""},{"$f":"IF(ISERROR(AN16*AO16),0,AN16*AO16)","v":0},{"$f":"AI16","v":0}]
[null,null,null,null,null,null,null,null,null,null,null,null,null,null,null,null,null,null,null,null,null,null,null,null,null,null,null,null,null,null,null,null,null,null,null,null,null,null,{"$f":"AF17","v":0},{"$f":"IF(E17<>\"\",E17,C17)","v":0},{"$f":"IF(I17<>\"\",I17,G17)","v":0},{"$f":"IF(ISERROR(AN17*AO17),0,AN17*AO17)","v":0},{"$f":"AI17","v":0}]
[null,null,{"$f":"IF(E18>0,\"\",IF(E16>0,\"\",IF(AND(AF18>1,AI16+AI18=0),Fordelt_areal/2,IF(AF18>1,Fordelt_areal,\"\"))))","v":""},{"$f":"IF(C18<>\"\",\"ha\",\"\")","v":""},null,"ha",{"$f":"IF(I18<>\"\",\"\",IF(VLOOKUP(AF18,_Afg07,Udbyttenr2)=0,\"\",VLOOKUP(AF18,_Afg07,Udbyttenr2)))","v":""},{"$f":"IF(G18=\"\",\"\",IF(AF18>1,IF(VLOOKUP(AF18,_Afg07,3)<>\"\",VLOOKUP(AF18,_Afg07,3),\"\"),\"\"))","v":""},null,"hkg",null,null,null,null,null,null,null,null,null,null,null,null,null,null,null,null,null,null,null,null,null,1,null,{"$f":"IF(AND(E18<>\"\",VLOOKUP(AF18,_Afg07,3)<>\"\"),E18,0)","v":0},{"$f":"IF(AND(AF18>1,VLOOKUP(AF18,_Afg07,3)=\"\"),1,0)","v":0},{"$f":"IF(AND(E18<>\"\",AF18>1,VLOOKUP(AF18,_Afg07,3)=\"\"),E18,0)","v":0},null,null,1,"","",0,0]
[null,null,null,null,null,null,null,null,null,null,null,null,null,null,null,null,null,null,null,null,null,null,null,null,null,null,null,null,null,null,null,null,null,null,null,null,null,null,0,0,0,0,0]
[null,null,null,null,null,null,null,null,null,null,null,null,null,null,null,null,null,null,null,null,null,null,null,null,null,null,null,null,null,null,null,null,null,null,null,null,null,null,0,0,0,0,0]
[2,null,{"$f":"IF(E21>0,\"\",IF(AND(AF21>1,AF23>1,AI21+AI23=0),Fordelt_areal/2,IF(AF21>1,Fordelt_areal,\"\")))","v":""},{"$f":"IF(C21<>\"\",\"ha\",\"\")","v":""},null,"ha",{"$f":"IF(I21<>\"\",\"\",IF(VLOOKUP(AF21,_Afg07,Udbyttenr2)=0,\"\",VLOOKUP(AF21,_Afg07,Udbyttenr2)))","v":""},{"$f":"IF(G21=\"\",\"\",IF(AF21>1,IF(VLOOKUP(AF21,_Afg07,3)<>\"\",VLOOKUP(AF21,_Afg07,3),\"\"),\"\"))","v":""},null,"hkg",null,null,null,null,null,null,null,null,null,null,null,null,null,null,null,null,null,null,null,null,{"$f":"A21","v":2},1,{"$f":"IF(AND(AF21>1,AH21=0),1,0)","v":0},{"$f":"IF(AND(E21<>\"\",VLOOKUP(AF21,_Afg07,3)<>\"\"),E21,0)","v":0},{"$f":"IF(AND(AF21>1,VLOOKUP(AF21,_Afg07,3)=\"\"),1,0)","v":0},{"$f":"IF(AND(E21<>\"\",AF21>1,VLOOKUP(AF21,_Afg07,3)=\"\"),E21,0)","v":0},null,null,1,"","",0,0]
[null,null,null,null,null,null,null,null,null,null,null,null,null,null,null,null,null,null,null,null,null,null,null,null,null,null,null,null,null,null,null,null,null,null,null,null,null,null,0,0,0,0,0]
[null,null,{"$f":"IF(E23>0,\"\",IF(E21>0,\"\",IF(AND(AF23>1,AI21+AI23=0),Fordelt_areal/2,IF(AF23>1,Fordelt_areal,\"\"))))","v":""},{"$f":"IF(C23<>\"\",\"ha\",\"\")","v":""},null,"ha",{"$f":"IF(I23<>\"\",\"\",IF(VLOOKUP(AF23,_Afg07,Udbyttenr2)=0,\"\",VLOOKUP(AF23,_Afg07,Udbyttenr2)))","v":""},{"$f":"IF(G23=\"\",\"\",IF(AF23>1,IF(VLOOKUP(AF23,_Afg07,3)<>\"\",VLOOKUP(AF23,_Afg07,3),\"\"),\"\"))","v":""},null,"hkg",null,null,null,null,null,null,null,null,null,null,null,null,null,null,null,null,null,null,null,null,null,1,null,{"$f":"IF(AND(E23<>\"\",VLOOKUP(AF23,_Afg07,3)<>\"\"),E23,0)","v":0},{"$f":"IF(AND(AF23>1,VLOOKUP(AF23,_Afg07,3)=\"\"),1,0)","v":0},{"$f":"IF(AND(E23<>\"\",AF23>1,VLOOKUP(AF23,_Afg07,3)=\"\"),E23,0)","v":0},null,null,1,"","",0,0]
[null,null,null,null,null,null,null,null,null,null,null,null,null,null,null,null,null,null,null,null,null,null,null,null,null,null,null,null,null,null,null,null,null,null,null,null,null,null,0,0,0,0,0]
[null,null,null,null,null,null,null,null,null,null,null,null,null,null,null,null,null,null,null,null,null,null,null,null,null,null,null,null,null,null,null,null,null,null,null,null,null,null,0,0,0,0,0]
[3,null,{"$f":"IF(E26>0,\"\",IF(AND(AF26>1,AF28>1,AI26+AI28=0),Fordelt_areal/2,IF(AF26>1,Fordelt_areal,\"\")))","v":""},{"$f":"IF(C26<>\"\",\"ha\",\"\")","v":""},null,"ha",{"$f":"IF(I26<>\"\",\"\",IF(VLOOKUP(AF26,_Afg07,Udbyttenr2)=0,\"\",VLOOKUP(AF26,_Afg07,Udbyttenr2)))","v":""},{"$f":"IF(G26=\"\",\"\",IF(AF26>1,IF(VLOOKUP(AF26,_Afg07,3)<>\"\",VLOOKUP(AF26,_Afg07,3),\"\"),\"\"))","v":""},null,"hkg",null,null,null,null,null,null,null,null,null,null,null,null,null,null,null,null,null,null,null,null,{"$f":"A26","v":3},1,{"$f":"IF(AND(AF26>1,AH26=0),1,0)","v":0},{"$f":"IF(AND(E26<>\"\",VLOOKUP(AF26,_Afg07,3)<>\"\"),E26,0)","v":0},{"$f":"IF(AND(AF26>1,VLOOKUP(AF26,_Afg07,3)=\"\"),1,0)","v":0},{"$f":"IF(AND(E26<>\"\",AF26>1,VLOOKUP(AF26,_Afg07,3)=\"\"),E26,0)","v":0},null,null,1,"","",0,0]
[null,null,null,null,null,null,null,null,null,null,null,null,null,null,null,null,null,null,null,null,null,null,null,null,null,null,null,null,null,null,null,null,null,null,null,null,null,null,0,0,0,0,0]
[null,null,{"$f":"IF(E28>0,\"\",IF(E26>0,\"\",IF(AND(AF28>1,AI26+AI28=0),Fordelt_areal/2,IF(AF28>1,Fordelt_areal,\"\"))))","v":""},{"$f":"IF(C28<>\"\",\"ha\",\"\")","v":""},null,"ha",{"$f":"IF(I28<>\"\",\"\",IF(VLOOKUP(AF28,_Afg07,Udbyttenr2)=0,\"\",VLOOKUP(AF28,_Afg07,Udbyttenr2)))","v":""},{"$f":"IF(G28=\"\",\"\",IF(AF28>1,IF(VLOOKUP(AF28,_Afg07,3)<>\"\",VLOOKUP(AF28,_Afg07,3),\"\"),\"\"))","v":""},null,"hkg",null,null,null,null,null,null,null,null,null,null,null,null,null,null,null,null,null,null,null,null,null,1,null,{"$f":"IF(AND(E28<>\"\",VLOOKUP(AF28,_Afg07,3)<>\"\"),E28,0)","v":0},{"$f":"IF(AND(AF28>1,VLOOKUP(AF28,_Afg07,3)=\"\"),1,0)","v":0},{"$f":"IF(AND(E28<>\"\",AF28>1,VLOOKUP(AF28,_Afg07,3)=\"\"),E28,0)","v":0},null,null,1,"","",0,0]
[null,null,null,null,null,null,null,null,null,null,null,null,null,null,null,null,null,null,null,null,null,null,null,null,null,null,null,null,null,null,null,null,null,null,null,null,null,null,0,0,0,0,0]
[null,null,null,null,null,null,null,null,null,null,null,null,null,null,null,null,null,null,null,null,null,null,null,null,null,null,null,null,null,null,null,null,null,null,null,null,null,null,0,0,0,0,0]
[4,null,{"$f":"IF(E31>0,\"\",IF(AND(AF31>1,AF33>1,AI31+AI33=0),Fordelt_areal/2,IF(AF31>1,Fordelt_areal,\"\")))","v":""},{"$f":"IF(C31<>\"\",\"ha\",\"\")","v":""},null,"ha",{"$f":"IF(I31<>\"\",\"\",IF(VLOOKUP(AF31,_Afg07,Udbyttenr2)=0,\"\",VLOOKUP(AF31,_Afg07,Udbyttenr2)))","v":""},{"$f":"IF(G31=\"\",\"\",IF(AF31>1,IF(VLOOKUP(AF31,_Afg07,3)<>\"\",VLOOKUP(AF31,_Afg07,3),\"\"),\"\"))","v":""},null,"hkg",null,null,null,null,null,null,null,null,null,null,null,null,null,null,null,null,null,null,null,null,{"$f":"A31","v":4},1,{"$f":"IF(AND(AF31>1,AH31=0),1,0)","v":0},{"$f":"IF(AND(E31<>\"\",VLOOKUP(AF31,_Afg07,3)<>\"\"),E31,0)","v":0},{"$f":"IF(AND(AF31>1,VLOOKUP(AF31,_Afg07,3)=\"\"),1,0)","v":0},{"$f":"IF(AND(E31<>\"\",AF31>1,VLOOKUP(AF31,_Afg07,3)=\"\"),E31,0)","v":0},null,null,1,"","",0,0]
[null,null,null,null,null,null,null,null,null,null,null,null,null,null,null,null,null,null,null,null,null,null,null,null,null,null,null,null,null,null,null,null,null,null,null,null,null,null,0,0,0,0,0]
[null,null,{"$f":"IF(E33>0,\"\",IF(E31>0,\"\",IF(AND(AF33>1,AI31+AI33=0),Fordelt_areal/2,IF(AF33>1,Fordelt_areal,\"\"))))","v":""},{"$f":"IF(C33<>\"\",\"ha\",\"\")","v":""},null,"ha",{"$f":"IF(I33<>\"\",\"\",IF(VLOOKUP(AF33,_Afg07,Udbyttenr2)=0,\"\",VLOOKUP(AF33,_Afg07,Udbyttenr2)))","v":""},{"$f":"IF(G33=\"\",\"\",IF(AF33>1,IF(VLOOKUP(AF33,_Afg07,3)<>\"\",VLOOKUP(AF33,_Afg07,3),\"\"),\"\"))","v":""},null,"hkg",null,null,null,null,null,null,null,null,null,null,null,null,null,null,null,null,null,null,null,null,null,1,null,{"$f":"IF(AND(E33<>\"\",VLOOKUP(AF33,_Afg07,3)<>\"\"),E33,0)","v":0},{"$f":"IF(AND(AF33>1,VLOOKUP(AF33,_Afg07,3)=\"\"),1,0)","v":0},{"$f":"IF(AND(E33<>\"\",AF33>1,VLOOKUP(AF33,_Afg07,3)=\"\"),E33,0)","v":0},null,null,1,"","",0,0]
[null,null,null,null,null,null,null,null,null,null,null,null,null,null,null,null,null,null,null,null,null,null,null,null,null,null,null,null,null,null,null,null,null,null,null,null,null,null,0,0,0,0,0]
[null,null,null,null,null,null,null,null,null,null,null,null,null,null,null,null,null,null,null,null,null,null,null,null,null,null,null,null,null,null,null,null,null,null,null,null,null,null,0,0,0,0,0]
[5,null,{"$f":"IF(E36>0,\"\",IF(AND(AF36>1,AF38>1,AI36+AI38=0),Fordelt_areal/2,IF(AF36>1,Fordelt_areal,\"\")))","v":""},{"$f":"IF(C36<>\"\",\"ha\",\"\")","v":""},null,"ha",{"$f":"IF(I36<>\"\",\"\",IF(VLOOKUP(AF36,_Afg07,Udbyttenr2)=0,\"\",VLOOKUP(AF36,_Afg07,Udbyttenr2)))","v":""},{"$f":"IF(G36=\"\",\"\",IF(AF36>1,IF(VLOOKUP(AF36,_Afg07,3)<>\"\",VLOOKUP(AF36,_Afg07,3),\"\"),\"\"))","v":""},null,"hkg",null,null,null,null,null,null,null,null,null,null,null,null,null,null,null,null,null,null,null,null,{"$f":"A36","v":5},1,{"$f":"IF(AND(AF36>1,AH36=0),1,0)","v":0},{"$f":"IF(AND(E36<>\"\",VLOOKUP(AF36,_Afg07,3)<>\"\"),E36,0)","v":0},{"$f":"IF(AND(AF36>1,VLOOKUP(AF36,_Afg07,3)=\"\"),1,0)","v":0},{"$f":"IF(AND(E36<>\"\",AF36>1,VLOOKUP(AF36,_Afg07,3)=\"\"),E36,0)","v":0},null,null,1,"","",0,0]
[null,null,null,null,null,null,null,null,null,null,null,null,null,null,null,null,null,null,null,null,null,null,null,null,null,null,null,null,null,null,null,null,null,null,null,null,null,null,0,0,0,0,0]
[null,null,{"$f":"IF(E38>0,\"\",IF(E36>0,\"\",IF(AND(AF38>1,AI36+AI38=0),Fordelt_areal/2,IF(AF38>1,Fordelt_areal,\"\"))))","v":""},{"$f":"IF(C38<>\"\",\"ha\",\"\")","v":""},null,"ha",{"$f":"IF(I38<>\"\",\"\",IF(VLOOKUP(AF38,_Afg07,Udbyttenr2)=0,\"\",VLOOKUP(AF38,_Afg07,Udbyttenr2)))","v":""},{"$f":"IF(G38=\"\",\"\",IF(AF38>1,IF(VLOOKUP(AF38,_Afg07,3)<>\"\",VLOOKUP(AF38,_Afg07,3),\"\"),\"\"))","v":""},null,"hkg",null,null,null,null,null,null,null,null,null,null,null,null,null,null,null,null,null,null,null,null,null,1,null,{"$f":"IF(AND(E38<>\"\",VLOOKUP(AF38,_Afg07,3)<>\"\"),E38,0)","v":0},{"$f":"IF(AND(AF38>1,VLOOKUP(AF38,_Afg07,3)=\"\"),1,0)","v":0},{"$f":"IF(AND(E38<>\"\",AF38>1,VLOOKUP(AF38,_Afg07,3)=\"\"),E38,0)","v":0},null,null,1,"","",0,0]
[null,null,null,null,null,null,null,null,null,null,null,null,null,null,null,null,null,null,null,null,null,null,null,null,null,null,null,null,null,null,null,null,null,null,null,null,null,null,0,0,0,0,0]
[null,null,null,null,null,null,null,null,null,null,null,null,null,null,null,null,null,null,null,null,null,null,null,null,null,null,null,null,null,null,null,null,null,null,null,null,null,null,0,0,0,0,0]
[6,null,{"$f":"IF(E41>0,\"\",IF(AND(AF41>1,AF43>1,AI41+AI43=0),Fordelt_areal/2,IF(AF41>1,Fordelt_areal,\"\")))","v":""},{"$f":"IF(C41<>\"\",\"ha\",\"\")","v":""},null,"ha",{"$f":"IF(I41<>\"\",\"\",IF(VLOOKUP(AF41,_Afg07,Udbyttenr2)=0,\"\",VLOOKUP(AF41,_Afg07,Udbyttenr2)))","v":""},{"$f":"IF(G41=\"\",\"\",IF(AF41>1,IF(VLOOKUP(AF41,_Afg07,3)<>\"\",VLOOKUP(AF41,_Afg07,3),\"\"),\"\"))","v":""},null,"hkg",null,null,null,null,null,null,null,null,null,null,null,null,null,null,null,null,null,null,null,null,{"$f":"A41","v":6},1,{"$f":"IF(AND(AF41>1,AH41=0),1,0)","v":0},{"$f":"IF(AND(E41<>\"\",VLOOKUP(AF41,_Afg07,3)<>\"\"),E41,0)","v":0},{"$f":"IF(AND(AF41>1,VLOOKUP(AF41,_Afg07,3)=\"\"),1,0)","v":0},{"$f":"IF(AND(E41<>\"\",AF41>1,VLOOKUP(AF41,_Afg07,3)=\"\"),E41,0)","v":0},null,null,1,"","",0,0]
[null,null,null,null,null,null,null,null,null,null,null,null,null,null,null,null,null,null,null,null,null,null,null,null,null,null,null,null,null,null,null,null,null,null,null,null,null,null,0,0,0,0,0]
[null,null,{"$f":"IF(E43>0,\"\",IF(E41>0,\"\",IF(AND(AF43>1,AI41+AI43=0),Fordelt_areal/2,IF(AF43>1,Fordelt_areal,\"\"))))","v":""},{"$f":"IF(C43<>\"\",\"ha\",\"\")","v":""},null,"ha",{"$f":"IF(I43<>\"\",\"\",IF(VLOOKUP(AF43,_Afg07,Udbyttenr2)=0,\"\",VLOOKUP(AF43,_Afg07,Udbyttenr2)))","v":""},{"$f":"IF(G43=\"\",\"\",IF(AF43>1,IF(VLOOKUP(AF43,_Afg07,3)<>\"\",VLOOKUP(AF43,_Afg07,3),\"\"),\"\"))","v":""},null,"hkg",null,null,null,null,null,null,null,null,null,null,null,null,null,null,null,null,null,null,null,null,null,1,null,{"$f":"IF(AND(E43<>\"\",VLOOKUP(AF43,_Afg07,3)<>\"\"),E43,0)","v":0},{"$f":"IF(AND(AF43>1,VLOOKUP(AF43,_Afg07,3)=\"\"),1,0)","v":0},{"$f":"IF(AND(E43<>\"\",AF43>1,VLOOKUP(AF43,_Afg07,3)=\"\"),E43,0)","v":0},null,null,1,"","",0,0]
[null,null,null,null,null,null,null,null,null,null,null,null,null,null,null,null,null,null,null,null,null,null,null,null,null,null,null,null,null,null,null,null,null,null,null,null,null,null,0,0,0,0,0]
[null,null,null,null,null,null,null,null,null,null,null,null,null,null,null,null,null,null,null,null,null,null,null,null,null,null,null,null,null,null,null,null,null,null,null,null,null,null,0,0,0,0,0]
[7,null,{"$f":"IF(E46>0,\"\",IF(AND(AF46>1,AF48>1,AI46+AI48=0),Fordelt_areal/2,IF(AF46>1,Fordelt_areal,\"\")))","v":""},{"$f":"IF(C46<>\"\",\"ha\",\"\")","v":""},null,"ha",{"$f":"IF(I46<>\"\",\"\",IF(VLOOKUP(AF46,_Afg07,Udbyttenr2)=0,\"\",VLOOKUP(AF46,_Afg07,Udbyttenr2)))","v":""},{"$f":"IF(G46=\"\",\"\",IF(AF46>1,IF(VLOOKUP(AF46,_Afg07,3)<>\"\",VLOOKUP(AF46,_Afg07,3),\"\"),\"\"))","v":""},null,"hkg",null,null,null,null,null,null,null,null,null,null,null,null,null,null,null,null,null,null,null,null,{"$f":"A46","v":7},1,{"$f":"IF(AND(AF46>1,AH46=0),1,0)","v":0},{"$f":"IF(AND(E46<>\"\",VLOOKUP(AF46,_Afg07,3)<>\"\"),E46,0)","v":0},{"$f":"IF(AND(AF46>1,VLOOKUP(AF46,_Afg07,3)=\"\"),1,0)","v":0},{"$f":"IF(AND(E46<>\"\",AF46>1,VLOOKUP(AF46,_Afg07,3)=\"\"),E46,0)","v":0},null,null,1,"","",0,0]
[null,null,null,null,null,null,null,null,null,null,null,null,null,null,null,null,null,null,null,null,null,null,null,null,null,null,null,null,null,null,null,null,null,null,null,null,null,null,0,0,0,0,0]
[null,null,{"$f":"IF(E48>0,\"\",IF(E46>0,\"\",IF(AND(AF48>1,AI46+AI48=0),Fordelt_areal/2,IF(AF48>1,Fordelt_areal,\"\"))))","v":""},{"$f":"IF(C48<>\"\",\"ha\",\"\")","v":""},null,"ha",{"$f":"IF(I48<>\"\",\"\",IF(VLOOKUP(AF48,_Afg07,Udbyttenr2)=0,\"\",VLOOKUP(AF48,_Afg07,Udbyttenr2)))","v":""},{"$f":"IF(G48=\"\",\"\",IF(AF48>1,IF(VLOOKUP(AF48,_Afg07,3)<>\"\",VLOOKUP(AF48,_Afg07,3),\"\"),\"\"))","v":""},null,"hkg",null,null,null,null,null,null,null,null,null,null,null,null,null,null,null,null,null,null,null,null,null,1,null,{"$f":"IF(AND(E48<>\"\",VLOOKUP(AF48,_Afg07,3)<>\"\"),E48,0)","v":0},{"$f":"IF(AND(AF48>1,VLOOKUP(AF48,_Afg07,3)=\"\"),1,0)","v":0},{"$f":"IF(AND(E48<>\"\",AF48>1,VLOOKUP(AF48,_Afg07,3)=\"\"),E48,0)","v":0},null,null,1,"","",0,0]
[]
[null,null,null,null,null,null,null,null,null,null,null,null,null,null,null,null,null,null,null,null,null,null,null,null,null,null,null,null,null,null,"Sum",null,{"$f":"AG16+AG18+AG21+AG23+AG26+AG28+AG31+AG33+AG36+AG38+AG41+AG43+AG46+AG48","v":0},{"$f":"AH16+AH18+AH21+AH23+AH26+AH28+AH31+AH33+AH36+AH38+AH41+AH43+AH46+AH48","v":0},null,{"$f":"AJ16+AJ18+AJ21+AJ23+AJ26+AJ28+AJ31+AJ33+AJ36+AJ38+AJ41+AJ43+AJ46+AJ48","v":0}]
["Delsædskifte 2"]
[]
[]
[null,"Marker/ejendomme:",null,null,null,null,null,null,null,null,null,null,null,null,null,null,null,null,null,null,null,null,null,null,null,null,null,null,null,null,null,null,"Udbyttenr3"]
[]
[null,"Jordtype",null,null,null,null,null,null,null,null,null,null,null,null,null,null,null,null,null,null,null,null,null,null,null,null,null,null,null,null,null,4,{"$f":"IF(AF56=1,5,IF(AF56=2,6,IF(AF56=3,7,IF(AF56=4,8,IF(AF56=5,9,\"\")))))","v":8},"Areal"]
[null,null,null,null,null,null,null,null,null,null,null,null,null,null,null,null,null,null,null,null,null,null,null,null,null,null,null,null,null,null,null,null,null,"til fordeling","Fordelt_areal"]
[null,"Samlet areal",null,"ha",null,null,null,null,null,null,null,null,null,null,null,null,null,null,null,null,null,null,null,null,null,null,null,null,null,null,null,null,null,{"$f":"C58-AH96","v":0},{"$f":"Areal_fordel2/Antal_skifter2","v":{"$error":"#DIV/0!"}}]
[]
["Afgrødefølge",null,"  Areal",null,null,null," Udbytte pr. ha",null,null,null,null,"Kommentarer",null,null,null,null,null,null,null,null,null,null,null,null,null,null,null,null,null,null,null,null,"Antal","Areal","Efter-","Areal"]
[null,null,null,null,null,null,null,null,null,null,null,null,null,null,null,null,null,null,null,null,null,null,null,null,null,null,null,null,null,null,"Afgrødefølge",null,"skifter","indtastet","afgrøde","indtastet efterafgrøde"]
[1,null,{"$f":"IF(E62>0,\"\",IF(AND(AF62>1,AF64>1,AI62+AI64=0),Fordelt_areal2/2,IF(AF62>1,Fordelt_areal2,\"\")))","v":""},{"$f":"IF(C62<>\"\",\"ha\",\"\")","v":""},null,"ha",{"$f":"IF(I62<>\"\",\"\",IF(VLOOKUP(AF62,_Afg07,Udbyttenr3)=0,\"\",VLOOKUP(AF62,_Afg07,Udbyttenr3)))","v":""},{"$f":"IF(G62=\"\",\"\",IF(AF62>1,IF(VLOOKUP(AF62,_Afg07,3)<>\"\",VLOOKUP(AF62,_Afg07,3),\"\"),\"\"))","v":""},null,"hkg",null,null,null,null,null,null,null,null,"Du kan angive både afgrøde og efterafgrøde. \nMan kan også dele arealet mellem 2 afgrøder.",null,null,null,null,null,null,null,null,null,null,null,{"$f":"A62","v":1},1,{"$f":"IF(AND(AF62>1,AH62=0),1,0)","v":0},{"$f":"IF(AND(E62<>\"\",VLOOKUP(AF62,_Afg07,3)<>\"\"),E62,0)","v":0},{"$f":"IF(AND(AF62>1,VLOOKUP(AF62,_Afg07,3)=\"\"),1,0)","v":0},{"$f":"IF(AND(E62<>\"\",AF62>1,VLOOKUP(AF62,_Afg07,3)=\"\"),E62,0)","v":0},null,null,1,"","",0,{"$f":"AI62","v":0}]
[null,null,null,null,null,null,null,null,null,null,null,null,null,null,null,null,null,null,null,null,null,null,null,null,null,null,null,null,null,null,null,null,null,null,null,null,null,null,0,0,0,0,0]
[null,null,{"$f":"IF(E64>0,\"\",IF(E62>0,\"\",IF(AND(AF64>1,AI62+AI64=0),Fordelt_areal2/2,IF(AF64>1,Fordelt_areal2,\"\"))))","v":""},{"$f":"IF(C64<>\"\",\"ha\",\"\")","v":""},null,"ha",{"$f":"IF(I64<>\"\",\"\",IF(VLOOKUP(AF64,_Afg07,Udbyttenr3)=0,\"\",VLOOKUP(AF64,_Afg07,Udbyttenr3)))","v":""},{"$f":"IF(G64=\"\",\"\",IF(AF64>1,IF(VLOOKUP(AF64,_Afg07,3)<>\"\",VLOOKUP(AF64,_Afg07,3),\"\"),\"\"))","v":""},null,"hkg",null,null,null,null,null,null,null,null,null,null,null,null,null,null,null,null,null,null,null,null,null,1,null,{"$f":"IF(AND(E64<>\"\",VLOOKUP(AF64,_Afg07,3)<>\"\"),E64,0)","v":0},{"$f":"IF(AND(AF64>1,VLOOKUP(AF64,_Afg07,3)=\"\"),1,0)","v":0},{"$f":"IF(AND(E64<>\"\",AF64>1,VLOOKUP(AF64,_Afg07,3)=\"\"),E64,0)","v":0},null,null,1,"","",0,0]
[null,null,null,null,null,null,null,null,null,null,null,null,null,null,null,null,null,null,null,null,null,null,null,null,null,null,null,null,null,null,null,null,null,null,null,null,null,null,0,0,0,0,0]
[null,null,null,null,null,null,null,null,null,null,null,null,null,null,null,null,null,null,null,null,null,null,null,null,null,null,null,null,null,null,null,null,null,null,null,null,null,null,0,0,0,0,0]
[2,null,{"$f":"IF(E67>0,\"\",IF(AND(AF67>1,AF69>1,AI67+AI69=0),Fordelt_areal2/2,IF(AF67>1,Fordelt_areal2,\"\")))","v":""},{"$f":"IF(C67<>\"\",\"ha\",\"\")","v":""},null,"ha",{"$f":"IF(I67<>\"\",\"\",IF(VLOOKUP(AF67,_Afg07,Udbyttenr3)=0,\"\",VLOOKUP(AF67,_Afg07,Udbyttenr3)))","v":""},{"$f":"IF(G67=\"\",\"\",IF(AF67>1,IF(VLOOKUP(AF67,_Afg07,3)<>\"\",VLOOKUP(AF67,_Afg07,3),\"\"),\"\"))","v":""},null,"hkg",null,null,null,null,null,null,null,null,null,null,null,null,null,null,null,null,null,null,null,null,{"$f":"A67","v":2},1,{"$f":"IF(AND(AF67>1,AH67=0),1,0)","v":0},{"$f":"IF(AND(E67<>\"\",VLOOKUP(AF67,_Afg07,3)<>\"\"),E67,0)","v":0},{"$f":"IF(AND(AF67>1,VLOOKUP(AF67,_Afg07,3)=\"\"),1,0)","v":0},{"$f":"IF(AND(E67<>\"\",AF67>1,VLOOKUP(AF67,_Afg07,3)=\"\"),E67,0)","v":0},null,null,1,"","",0,0]
[null,null,null,null,null,null,null,null,null,null,null,null,null,null,null,null,null,null,null,null,null,null,null,null,null,null,null,null,null,null,null,null,null,null,null,null,null,null,0,0,0,0,0]
[null,null,{"$f":"IF(E69>0,\"\",IF(E67>0,\"\",IF(AND(AF69>1,AI67+AI69=0),Fordelt_areal2/2,IF(AF69>1,Fordelt_areal2,\"\"))))","v":""},{"$f":"IF(C69<>\"\",\"ha\",\"\")","v":""},null,"ha",{"$f":"IF(I69<>\"\",\"\",IF(VLOOKUP(AF69,_Afg07,Udbyttenr3)=0,\"\",VLOOKUP(AF69,_Afg07,Udbyttenr3)))","v":""},{"$f":"IF(G69=\"\",\"\",IF(AF69>1,IF(VLOOKUP(AF69,_Afg07,3)<>\"\",VLOOKUP(AF69,_Afg07,3),\"\"),\"\"))","v":""},null,"hkg",null,null,null,null,null,null,null,null,null,null,null,null,null,null,null,null,null,null,null,null,null,1,null,{"$f":"IF(AND(E69<>\"\",VLOOKUP(AF69,_Afg07,3)<>\"\"),E69,0)","v":0},{"$f":"IF(AND(AF69>1,VLOOKUP(AF69,_Afg07,3)=\"\"),1,0)","v":0},{"$f":"IF(AND(E69<>\"\",AF69>1,VLOOKUP(AF69,_Afg07,3)=\"\"),E69,0)","v":0},null,null,1,"","",0,0]
[null,null,null,null,null,null,null,null,null,null,null,null,null,null,null,null,null,null,null,null,null,null,null,null,null,null,null,null,null,null,null,null,null,null,null,null,null,null,0,0,0,0,0]
[null,null,null,null,null,null,null,null,null,null,null,null,null,null,null,null,null,null,null,null,null,null,null,null,null,null,null,null,null,null,null,2,null,null,null,null,null,null,2,0,0,0,0]
[3,null,{"$f":"IF(E72>0,\"\",IF(AND(AF72>1,AF74>1,AI72+AI74=0),Fordelt_areal2/2,IF(AF72>1,Fordelt_areal2,\"\")))","v":""},{"$f":"IF(C72<>\"\",\"ha\",\"\")","v":""},null,"ha",{"$f":"IF(I72<>\"\",\"\",IF(VLOOKUP(AF72,_Afg07,Udbyttenr3)=0,\"\",VLOOKUP(AF72,_Afg07,Udbyttenr3)))","v":""},{"$f":"IF(G72=\"\",\"\",IF(AF72>1,IF(VLOOKUP(AF72,_Afg07,3)<>\"\",VLOOKUP(AF72,_Afg07,3),\"\"),\"\"))","v":""},null,"hkg",null,null,null,null,null,null,null,null,null,null,null,null,null,null,null,null,null,null,null,null,{"$f":"A72","v":3},1,{"$f":"IF(AND(AF72>1,AH72=0),1,0)","v":0},{"$f":"IF(AND(E72<>\"\",VLOOKUP(AF72,_Afg07,3)<>\"\"),E72,0)","v":0},{"$f":"IF(AND(AF72>1,VLOOKUP(AF72,_Afg07,3)=\"\"),1,0)","v":0},{"$f":"IF(AND(E72<>\"\",AF72>1,VLOOKUP(AF72,_Afg07,3)=\"\"),E72,0)","v":0},null,null,1,"","",0,0]
[null,null,null,null,null,null,null,null,null,null,null,null,null,null,null,null,null,null,null,null,null,null,null,null,null,null,null,null,null,null,null,null,null,null,null,null,null,null,0,0,0,0,0]
[null,null,{"$f":"IF(E74>0,\"\",IF(E72>0,\"\",IF(AND(AF74>1,AI72+AI74=0),Fordelt_areal2/2,IF(AF74>1,Fordelt_areal2,\"\"))))","v":""},{"$f":"IF(C74<>\"\",\"ha\",\"\")","v":""},null,"ha",{"$f":"IF(I74<>\"\",\"\",IF(VLOOKUP(AF74,_Afg07,Udbyttenr3)=0,\"\",VLOOKUP(AF74,_Afg07,Udbyttenr3)))","v":""},{"$f":"IF(G74=\"\",\"\",IF(AF74>1,IF(VLOOKUP(AF74,_Afg07,3)<>\"\",VLOOKUP(AF74,_Afg07,3),\"\"),\"\"))","v":""},null,"hkg",null,null,null,null,null,null,null,null,null,null,null,null,null,null,null,null,null,null,null,null,null,1,null,{"$f":"IF(AND(E74<>\"\",VLOOKUP(AF74,_Afg07,3)<>\"\"),E74,0)","v":0},{"$f":"IF(AND(AF74>1,VLOOKUP(AF74,_Afg07,3)=\"\"),1,0)","v":0},{"$f":"IF(AND(E74<>\"\",AF74>1,VLOOKUP(AF74,_Afg07,3)=\"\"),E74,0)","v":0},null,null,1,"","",0,0]
[null,null,null,null,null,null,null,null,null,null,null,null,null,null,null,null,null,null,null,null,null,null,null,null,null,null,null,null,null,null,null,null,null,null,null,null,null,null,0,0,0,0,0]
[null,null,null,null,null,null,null,null,null,null,null,null,null,null,null,null,null,null,null,null,null,null,null,null,null,null,null,null,null,null,null,null,null,null,null,null,null,null,0,0,0,0,0]
[4,null,{"$f":"IF(E77>0,\"\",IF(AND(AF77>1,AF79>1,AI77+AI79=0),Fordelt_areal2/2,IF(AF77>1,Fordelt_areal2,\"\")))","v":""},{"$f":"IF(C77<>\"\",\"ha\",\"\")","v":""},null,"ha",{"$f":"IF(I77<>\"\",\"\",IF(VLOOKUP(AF77,_Afg07,Udbyttenr3)=0,\"\",VLOOKUP(AF77,_Afg07,Udbyttenr3)))","v":""},{"$f":"IF(G77=\"\",\"\",IF(AF77>1,IF(VLOOKUP(AF77,_Afg07,3)<>\"\",VLOOKUP(AF77,_Afg07,3),\"\"),\"\"))","v":""},null,"hkg",null,null,null,null,null,null,null,null,null,null,null,null,null,null,null,null,null,null,null,null,{"$f":"A77","v":4},1,{"$f":"IF(AND(AF77>1,AH77=0),1,0)","v":0},{"$f":"IF(AND(E77<>\"\",VLOOKUP(AF77,_Afg07,3)<>\"\"),E77,0)","v":0},{"$f":"IF(AND(AF77>1,VLOOKUP(AF77,_Afg07,3)=\"\"),1,0)","v":0},{"$f":"IF(AND(E77<>\"\",AF77>1,VLOOKUP(AF77,_Afg07,3)=\"\"),E77,0)","v":0},null,null,1,"","",0,0]
[null,null,null,null,null,null,null,null,null,null,null,null,null,null,null,null,null,null,null,null,null,null,null,null,null,null,null,null,null,null,null,null,null,null,null,null,null,null,0,0,0,0,0]
[null,null,{"$f":"IF(E79>0,\"\",IF(E77>0,\"\",IF(AND(AF79>1,AI77+AI79=0),Fordelt_areal2/2,IF(AF79>1,Fordelt_areal2,\"\"))))","v":""},{"$f":"IF(C79<>\"\",\"ha\",\"\")","v":""},null,"ha",{"$f":"IF(I79<>\"\",\"\",IF(VLOOKUP(AF79,_Afg07,Udbyttenr3)=0,\"\",VLOOKUP(AF79,_Afg07,Udbyttenr3)))","v":""},{"$f":"IF(G79=\"\",\"\",IF(AF79>1,IF(VLOOKUP(AF79,_Afg07,3)<>\"\",VLOOKUP(AF79,_Afg07,3),\"\"),\"\"))","v":""},null,"hkg",null,null,null,null,null,null,null,null,null,null,null,null,null,null,null,null,null,null,null,null,null,1,null,{"$f":"IF(AND(E79<>\"\",VLOOKUP(AF79,_Afg07,3)<>\"\"),E79,0)","v":0},{"$f":"IF(AND(AF79>1,VLOOKUP(AF79,_Afg07,3)=\"\"),1,0)","v":0},{"$f":"IF(AND(E79<>\"\",AF79>1,VLOOKUP(AF79,_Afg07,3)=\"\"),E79,0)","v":0},null,null,1,"","",0,0]
[null,null,null,null,null,null,null,null,null,null,null,null,null,null,null,null,null,null,null,null,null,null,null,null,null,null,null,null,null,null,null,null,null,null,null,null,null,null,0,0,0,0,0]
[null,null,null,null,null,null,null,null,null,null,null,null,null,null,null,null,null,null,null,null,null,null,null,null,null,null,null,null,null,null,null,null,null,null,null,null,null,null,{"$f":"AF81","v":0},{"$f":"IF(E81<>\"\",E81,C81)","v":0},{"$f":"IF(I81<>\"\",I81,G81)","v":0},{"$f":"IF(ISERROR(AN81*AO81),0,AN81*AO81)","v":0},0]
[5,null,{"$f":"IF(E82>0,\"\",IF(AND(AF82>1,AF84>1,AI82+AI84=0),Fordelt_areal2/2,IF(AF82>1,Fordelt_areal2,\"\")))","v":""},{"$f":"IF(C82<>\"\",\"ha\",\"\")","v":""},null,"ha",{"$f":"IF(I82<>\"\",\"\",IF(VLOOKUP(AF82,_Afg07,Udbyttenr3)=0,\"\",VLOOKUP(AF82,_Afg07,Udbyttenr3)))","v":""},{"$f":"IF(G82=\"\",\"\",IF(AF82>1,IF(VLOOKUP(AF82,_Afg07,3)<>\"\",VLOOKUP(AF82,_Afg07,3),\"\"),\"\"))","v":""},null,"hkg",null,null,null,null,null,null,null,null,null,null,null,null,null,null,null,null,null,null,null,null,{"$f":"A82","v":5},1,{"$f":"IF(AND(AF82>1,AH82=0),1,0)","v":0},{"$f":"IF(AND(E82<>\"\",VLOOKUP(AF82,_Afg07,3)<>\"\"),E82,0)","v":0},{"$f":"IF(AND(AF82>1,VLOOKUP(AF82,_Afg07,3)=\"\"),1,0)","v":0},{"$f":"IF(AND(E82<>\"\",AF82>1,VLOOKUP(AF82,_Afg07,3)=\"\"),E82,0)","v":0},null,null,1,"","",0,0]
[null,null,null,null,null,null,null,null,null,null,null,null,null,null,null,null,null,null,null,null,null,null,null,null,null,null,null,null,null,null,null,null,null,null,null,null,null,null,0,0,0,0,0]
[null,null,{"$f":"IF(E84>0,\"\",IF(E82>0,\"\",IF(AND(AF84>1,AI82+AI84=0),Fordelt_areal2/2,IF(AF84>1,Fordelt_areal2,\"\"))))","v":""},{"$f":"IF(C84<>\"\",\"ha\",\"\")","v":""},null,"ha",{"$f":"IF(I84<>\"\",\"\",IF(VLOOKUP(AF84,_Afg07,Udbyttenr3)=0,\"\",VLOOKUP(AF84,_Afg07,Udbyttenr3)))","v":""},{"$f":"IF(G84=\"\",\"\",IF(AF84>1,IF(VLOOKUP(AF84,_Afg07,3)<>\"\",VLOOKUP(AF84,_Afg07,3),\"\"),\"\"))","v":""},null,"hkg",null,null,null,null,null,null,null,null,null,null,null,null,null,null,null,null,null,null,null,null,null,1,null,{"$f":"IF(AND(E84<>\"\",VLOOKUP(AF84,_Afg07,3)<>\"\"),E84,0)","v":0},{"$f":"IF(AND(AF84>1,VLOOKUP(AF84,_Afg07,3)=\"\"),1,0)","v":0},{"$f":"IF(AND(E84<>\"\",AF84>1,VLOOKUP(AF84,_Afg07,3)=\"\"),E84,0)","v":0},null,null,1,"","",0,0]
[null,null,null,null,null,null,null,null,null,null,null,null,null,null,null,null,null,null,null,null,null,null,null,null,null,null,null,null,null,null,null,null,null,null,null,null,null,null,0,0,0,0,0]
[null,null,null,null,null,null,null,null,null,null,null,null,null,null,null,null,null,null,null,null,null,null,null,null,null,null,null,null,null,null,null,null,null,null,null,null,null,null,0,0,0,0,0]
[6,null,{"$f":"IF(E87>0,\"\",IF(AND(AF87>1,AF89>1,AI87+AI89=0),Fordelt_areal2/2,IF(AF87>1,Fordelt_areal2,\"\")))","v":""},{"$f":"IF(C87<>\"\",\"ha\",\"\")","v":""},null,"ha",{"$f":"IF(I87<>\"\",\"\",IF(VLOOKUP(AF87,_Afg07,Udbyttenr3)=0,\"\",VLOOKUP(AF87,_Afg07,Udbyttenr3)))","v":""},{"$f":"IF(G87=\"\",\"\",IF(AF87>1,IF(VLOOKUP(AF87,_Afg07,3)<>\"\",VLOOKUP(AF87,_Afg07,3),\"\"),\"\"))","v":""},null,"hkg",null,null,null,null,null,null,null,null,null,null,null,null,null,null,null,null,null,null,null,null,{"$f":"A87","v":6},1,{"$f":"IF(AND(AF87>1,AH87=0),1,0)","v":0},{"$f":"IF(AND(E87<>\"\",VLOOKUP(AF87,_Afg07,3)<>\"\"),E87,0)","v":0},{"$f":"IF(AND(AF87>1,VLOOKUP(AF87,_Afg07,3)=\"\"),1,0)","v":0},{"$f":"IF(AND(E87<>\"\",AF87>1,VLOOKUP(AF87,_Afg07,3)=\"\"),E87,0)","v":0},null,null,1,"","",0,0]
[null,null,null,null,null,null,null,null,null,null,null,null,null,null,null,null,null,null,null,null,null,null,null,null,null,null,null,null,null,null,null,null,null,null,null,null,null,null,0,0,0,0,0]
[null,null,{"$f":"IF(E89>0,\"\",IF(E87>0,\"\",IF(AND(AF89>1,AI87+AI89=0),Fordelt_areal2/2,IF(AF89>1,Fordelt_areal2,\"\"))))","v":""},{"$f":"IF(C89<>\"\",\"ha\",\"\")","v":""},null,"ha",{"$f":"IF(I89<>\"\",\"\",IF(VLOOKUP(AF89,_Afg07,Udbyttenr3)=0,\"\",VLOOKUP(AF89,_Afg07,Udbyttenr3)))","v":""},{"$f":"IF(G89=\"\",\"\",IF(AF89>1,IF(VLOOKUP(AF89,_Afg07,3)<>\"\",VLOOKUP(AF89,_Afg07,3),\"\"),\"\"))","v":""},null,"hkg",null,null,null,null,null,null,null,null,null,null,null,null,null,null,null,null,null,null,null,null,null,1,null,{"$f":"IF(AND(E89<>\"\",VLOOKUP(AF89,_Afg07,3)<>\"\"),E89,0)","v":0},{"$f":"IF(AND(AF89>1,VLOOKUP(AF89,_Afg07,3)=\"\"),1,0)","v":0},{"$f":"IF(AND(E89<>\"\",AF89>1,VLOOKUP(AF89,_Afg07,3)=\"\"),E89,0)","v":0},null,null,1,"","",0,0]
[null,null,null,null,null,null,null,null,null,null,null,null,null,null,null,null,null,null,null,null,null,null,null,null,null,null,null,null,null,null,null,null,null,null,null,null,null,null,0,0,0,0,0]
[null,null,null,null,null,null,null,null,null,null,null,null,null,null,null,null,null,null,null,null,null,null,null,null,null,null,null,null,null,null,null,null,null,null,null,null,null,null,0,0,0,0,0]
[7,null,{"$f":"IF(E92>0,\"\",IF(AND(AF92>1,AF94>1,AI92+AI94=0),Fordelt_areal2/2,IF(AF92>1,Fordelt_areal2,\"\")))","v":""},{"$f":"IF(C92<>\"\",\"ha\",\"\")","v":""},null,"ha",{"$f":"IF(I92<>\"\",\"\",IF(VLOOKUP(AF92,_Afg07,Udbyttenr3)=0,\"\",VLOOKUP(AF92,_Afg07,Udbyttenr3)))","v":""},{"$f":"IF(G92=\"\",\"\",IF(AF92>1,IF(VLOOKUP(AF92,_Afg07,3)<>\"\",VLOOKUP(AF92,_Afg07,3),\"\"),\"\"))","v":""},null,"hkg",null,null,null,null,null,null,null,null,null,null,null,null,null,null,null,null,null,null,null,null,{"$f":"A92","v":7},1,{"$f":"IF(AND(AF92>1,AH92=0),1,0)","v":0},{"$f":"IF(AND(E92<>\"\",VLOOKUP(AF92,_Afg07,3)<>\"\"),E92,0)","v":0},{"$f":"IF(AND(AF92>1,VLOOKUP(AF92,_Afg07,3)=\"\"),1,0)","v":0},{"$f":"IF(AND(E92<>\"\",AF92>1,VLOOKUP(AF92,_Afg07,3)=\"\"),E92,0)","v":0},null,null,1,"","",0,0]
[null,null,null,null,null,null,null,null,null,null,null,null,null,null,null,null,null,null,null,null,null,null,null,null,null,null,null,null,null,null,null,null,null,null,null,null,null,null,0,0,0,0,0]
[null,null,{"$f":"IF(E94>0,\"\",IF(E92>0,\"\",IF(AND(AF94>1,AI92+AI94=0),Fordelt_areal2/2,IF(AF94>1,Fordelt_areal2,\"\"))))","v":""},{"$f":"IF(C94<>\"\",\"ha\",\"\")","v":""},null,"ha",{"$f":"IF(I94<>\"\",\"\",IF(VLOOKUP(AF94,_Afg07,Udbyttenr3)=0,\"\",VLOOKUP(AF94,_Afg07,Udbyttenr3)))","v":""},{"$f":"IF(G94=\"\",\"\",IF(AF94>1,IF(VLOOKUP(AF94,_Afg07,3)<>\"\",VLOOKUP(AF94,_Afg07,3),\"\"),\"\"))","v":""},null,"hkg",null,null,null,null,null,null,null,null,null,null,null,null,null,null,null,null,null,null,null,null,null,1,null,{"$f":"IF(AND(E94<>\"\",VLOOKUP(AF94,_Afg07,3)<>\"\"),E94,0)","v":0},{"$f":"IF(AND(AF94>1,VLOOKUP(AF94,_Afg07,3)=\"\"),1,0)","v":0},{"$f":"IF(AND(E94<>\"\",AF94>1,VLOOKUP(AF94,_Afg07,3)=\"\"),E94,0)","v":0},null,null,1,"","",0,0]
[]
[null,null,null,null,null,null,null,null,null,null,null,null,null,null,null,null,null,null,null,null,null,null,null,null,null,null,null,null,null,null,"Sum",null,{"$f":"AG62+AG64+AG67+AG69+AG72+AG74+AG77+AG79+AG82+AG84+AG87+AG89+AG92+AG94","v":0},{"$f":"AH62+AH64+AH67+AH69+AH72+AH74+AH77+AH79+AH82+AH84+AH87+AH89+AH92+AH94","v":0},null,{"$f":"AJ62+AJ64+AJ67+AJ69+AJ72+AJ74+AJ77+AJ79+AJ82+AJ84+AJ87+AJ89+AJ92+AJ94","v":0}]
["Delsædskifte 3"]
[]
[]
[null,"Marker/ejendomme:",null,null,null,null,null,null,null,null,null,null,null,null,null,null,null,null,null,null,null,null,null,null,null,null,null,null,null,null,null,null,"Udbyttenr4"]
[]
[null,"Jordtype",null,null,null,null,null,null,null,null,null,null,null,null,null,null,null,null,null,null,null,null,null,null,null,null,null,null,null,null,null,4,{"$f":"IF(AF102=1,5,IF(AF102=2,6,IF(AF102=3,7,IF(AF102=4,8,IF(AF102=5,9,\"\")))))","v":8},"Areal"]
[null,null,null,null,null,null,null,null,null,null,null,null,null,null,null,null,null,null,null,null,null,null,null,null,null,null,null,null,null,null,null,null,null,"til fordeling","Fordelt_areal"]
[null,"Samlet areal",null,"ha",null,null,null,null,null,null,null,null,null,null,null,null,null,null,null,null,null,null,null,null,null,null,null,null,null,null,null,null,null,{"$f":"C104-AH142","v":0},{"$f":"Areal_fordel3/Antal_skifter3","v":{"$error":"#DIV/0!"}}]
[]
["Afgrødefølge",null,"  Areal",null,null,null," Udbytte pr. ha",null,null,null,null,"Kommentarer",null,null,null,null,null,null,null,null,null,null,null,null,null,null,null,null,null,null,null,null,"Antal","Areal","Efter-","Areal"]
[null,null,null,null,null,null,null,null,null,null,null,null,null,null,null,null,null,null,null,null,null,null,null,null,null,null,null,null,null,null,"Afgrødefølge",null,"skifter","indtastet","afgrøde","indtastet efterafgrøde"]
[1,null,{"$f":"IF(E108>0,\"\",IF(AND(AF108>1,AF110>1,AI108+AI110=0),Fordelt_areal3/2,IF(AF108>1,Fordelt_areal3,\"\")))","v":""},{"$f":"IF(C108<>\"\",\"ha\",\"\")","v":""},null,"ha",{"$f":"IF(I108<>\"\",\"\",IF(VLOOKUP(AF108,_Afg07,Udbyttenr4)=0,\"\",VLOOKUP(AF108,_Afg07,Udbyttenr4)))","v":""},{"$f":"IF(G108=\"\",\"\",IF(AF108>1,IF(VLOOKUP(AF108,_Afg07,3)<>\"\",VLOOKUP(AF108,_Afg07,3),\"\"),\"\"))","v":""},null,"hkg",null,null,null,null,null,null,null,null,null,null,null,null,null,null,null,null,null,null,null,null,{"$f":"A108","v":1},1,{"$f":"IF(AND(AF108>1,AH108=0),1,0)","v":0},{"$f":"IF(AND(E108<>\"\",VLOOKUP(AF108,_Afg07,3)<>\"\"),E108,0)","v":0},{"$f":"IF(AND(AF108>1,VLOOKUP(AF108,_Afg07,3)=\"\"),1,0)","v":0},{"$f":"IF(AND(E108<>\"\",AF108>1,VLOOKUP(AF108,_Afg07,3)=\"\"),E108,0)","v":0},null,null,1,"","",0,{"$f":"AI108","v":0}]
[null,null,null,null,null,null,null,null,null,null,null,null,null,null,null,null,null,null,null,null,null,null,null,null,null,null,null,null,null,null,null,null,null,null,null,null,null,null,0,0,0,0,0]
[null,null,{"$f":"IF(E110>0,\"\",IF(E108>0,\"\",IF(AND(AF110>1,AI108+AI110=0),Fordelt_areal3/2,IF(AF110>1,Fordelt_areal3,\"\"))))","v":""},{"$f":"IF(C110<>\"\",\"ha\",\"\")","v":""},null,"ha",{"$f":"IF(I110<>\"\",\"\",IF(VLOOKUP(AF110,_Afg07,Udbyttenr4)=0,\"\",VLOOKUP(AF110,_Afg07,Udbyttenr4)))","v":""},{"$f":"IF(G110=\"\",\"\",IF(AF110>1,IF(VLOOKUP(AF110,_Afg07,3)<>\"\",VLOOKUP(AF110,_Afg07,3),\"\"),\"\"))","v":""},null,"hkg",null,null,null,null,null,null,null,null,null,null,null,null,null,null,null,null,null,null,null,null,null,1,null,{"$f":"IF(AND(E110<>\"\",VLOOKUP(AF110,_Afg07,3)<>\"\"),E110,0)","v":0},{"$f":"IF(AND(AF110>1,VLOOKUP(AF110,_Afg07,3)=\"\"),1,0)","v":0},{"$f":"IF(AND(E110<>\"\",AF110>1,VLOOKUP(AF110,_Afg07,3)=\"\"),E110,0)","v":0},null,null,1,"","",0,0]
[null,null,null,null,null,null,null,null,null,null,null,null,null,null,null,null,null,null,null,null,null,null,null,null,null,null,null,null,null,null,null,null,null,null,null,null,null,null,0,0,0,0,0]
[null,null,null,null,null,null,null,null,null,null,null,null,null,null,null,null,null,null,null,null,null,null,null,null,null,null,null,null,null,null,null,null,null,null,null,null,null,null,0,0,0,0,0]
[2,null,{"$f":"IF(E113>0,\"\",IF(AND(AF113>1,AF115>1,AI113+AI115=0),Fordelt_areal3/2,IF(AF113>1,Fordelt_areal3,\"\")))","v":""},{"$f":"IF(C113<>\"\",\"ha\",\"\")","v":""},null,"ha",{"$f":"IF(I113<>\"\",\"\",IF(VLOOKUP(AF113,_Afg07,Udbyttenr4)=0,\"\",VLOOKUP(AF113,_Afg07,Udbyttenr4)))","v":""},{"$f":"IF(G113=\"\",\"\",IF(AF113>1,IF(VLOOKUP(AF113,_Afg07,3)<>\"\",VLOOKUP(AF113,_Afg07,3),\"\"),\"\"))","v":""},null,"hkg",null,null,null,null,null,null,null,null,null,null,null,null,null,null,null,null,null,null,null,null,{"$f":"A113","v":2},1,{"$f":"IF(AND(AF113>1,AH113=0),1,0)","v":0},{"$f":"IF(AND(E113<>\"\",VLOOKUP(AF113,_Afg07,3)<>\"\"),E113,0)","v":0},{"$f":"IF(AND(AF113>1,VLOOKUP(AF113,_Afg07,3)=\"\"),1,0)","v":0},{"$f":"IF(AND(E113<>\"\",AF113>1,VLOOKUP(AF113,_Afg07,3)=\"\"),E113,0)","v":0},null,null,1,"","",0,0]
[null,null,null,null,null,null,null,null,null,null,null,null,null,null,null,null,null,null,null,null,null,null,null,null,null,null,null,null,null,null,null,null,null,null,null,null,null,null,0,0,0,0,0]
[null,null,{"$f":"IF(E115>0,\"\",IF(E113>0,\"\",IF(AND(AF115>1,AI113+AI115=0),Fordelt_areal3/2,IF(AF115>1,Fordelt_areal3,\"\"))))","v":""},{"$f":"IF(C115<>\"\",\"ha\",\"\")","v":""},null,"ha",{"$f":"IF(I115<>\"\",\"\",IF(VLOOKUP(AF115,_Afg07,Udbyttenr4)=0,\"\",VLOOKUP(AF115,_Afg07,Udbyttenr4)))","v":""},{"$f":"IF(G115=\"\",\"\",IF(AF115>1,IF(VLOOKUP(AF115,_Afg07,3)<>\"\",VLOOKUP(AF115,_Afg07,3),\"\"),\"\"))","v":""},null,"hkg",null,null,null,null,null,null,null,null,null,null,null,null,null,null,null,null,null,null,null,null,null,1,null,{"$f":"IF(AND(E115<>\"\",VLOOKUP(AF115,_Afg07,3)<>\"\"),E115,0)","v":0},{"$f":"IF(AND(AF115>1,VLOOKUP(AF115,_Afg07,3)=\"\"),1,0)","v":0},{"$f":"IF(AND(E115<>\"\",AF115>1,VLOOKUP(AF115,_Afg07,3)=\"\"),E115,0)","v":0},null,null,1,"","",0,0]
[null,null,null,null,null,null,null,null,null,null,null,null,null,null,null,null,null,null,null,null,null,null,null,null,null,null,null,null,null,null,null,null,null,null,null,null,null,null,0,0,0,0,0]
[null,null,null,null,null,null,null,null,null,null,null,null,null,null,null,null,null,null,null,null,null,null,null,null,null,null,null,null,null,null,null,null,null,null,null,null,null,null,0,0,0,0,0]
[3,null,{"$f":"IF(E118>0,\"\",IF(AND(AF118>1,AF120>1,AI118+AI120=0),Fordelt_areal3/2,IF(AF118>1,Fordelt_areal3,\"\")))","v":""},{"$f":"IF(C118<>\"\",\"ha\",\"\")","v":""},null,"ha",{"$f":"IF(I118<>\"\",\"\",IF(VLOOKUP(AF118,_Afg07,Udbyttenr4)=0,\"\",VLOOKUP(AF118,_Afg07,Udbyttenr4)))","v":""},{"$f":"IF(G118=\"\",\"\",IF(AF118>1,IF(VLOOKUP(AF118,_Afg07,3)<>\"\",VLOOKUP(AF118,_Afg07,3),\"\"),\"\"))","v":""},null,"hkg",null,null,null,null,null,null,null,null,null,null,null,null,null,null,null,null,null,null,null,null,{"$f":"A118","v":3},1,{"$f":"IF(AND(AF118>1,AH118=0),1,0)","v":0},{"$f":"IF(AND(E118<>\"\",VLOOKUP(AF118,_Afg07,3)<>\"\"),E118,0)","v":0},{"$f":"IF(AND(AF118>1,VLOOKUP(AF118,_Afg07,3)=\"\"),1,0)","v":0},{"$f":"IF(AND(E118<>\"\",AF118>1,VLOOKUP(AF118,_Afg07,3)=\"\"),E118,0)","v":0},null,null,1,"","",0,0]
[null,null,null,null,null,null,null,null,null,null,null,null,null,null,null,null,null,null,null,null,null,null,null,null,null,null,null,null,null,null,null,null,null,null,null,null,null,null,0,0,0,0,0]
[null,null,{"$f":"IF(E120>0,\"\",IF(E118>0,\"\",IF(AND(AF120>1,AI118+AI120=0),Fordelt_areal3/2,IF(AF120>1,Fordelt_areal3,\"\"))))","v":""},{"$f":"IF(C120<>\"\",\"ha\",\"\")","v":""},null,"ha",{"$f":"IF(I120<>\"\",\"\",IF(VLOOKUP(AF120,_Afg07,Udbyttenr4)=0,\"\",VLOOKUP(AF120,_Afg07,Udbyttenr4)))","v":""},{"$f":"IF(G120=\"\",\"\",IF(AF120>1,IF(VLOOKUP(AF120,_Afg07,3)<>\"\",VLOOKUP(AF120,_Afg07,3),\"\"),\"\"))","v":""},null,"hkg",null,null,null,null,null,null,null,null,null,null,null,null,null,null,null,null,null,null,null,null,null,1,null,{"$f":"IF(AND(E120<>\"\",VLOOKUP(AF120,_Afg07,3)<>\"\"),E120,0)","v":0},{"$f":"IF(AND(AF120>1,VLOOKUP(AF120,_Afg07,3)=\"\"),1,0)","v":0},{"$f":"IF(AND(E120<>\"\",AF120>1,VLOOKUP(AF120,_Afg07,3)=\"\"),E120,0)","v":0},null,null,1,"","",0,0]
[null,null,null,null,null,null,null,null,null,null,null,null,null,null,null,null,null,null,null,null,null,null,null,null,null,null,null,null,null,null,null,null,null,null,null,null,null,null,0,0,0,0,0]
[null,null,null,null,null,null,null,null,null,null,null,null,null,null,null,null,null,null,null,null,null,null,null,null,null,null,null,null,null,null,null,null,null,null,null,null,null,null,0,0,0,0,0]
[4,null,{"$f":"IF(E123>0,\"\",IF(AND(AF123>1,AF125>1,AI123+AI125=0),Fordelt_areal3/2,IF(AF123>1,Fordelt_areal3,\"\")))","v":""},{"$f":"IF(C123<>\"\",\"ha\",\"\")","v":""},null,"ha",{"$f":"IF(I123<>\"\",\"\",IF(VLOOKUP(AF123,_Afg07,Udbyttenr4)=0,\"\",VLOOKUP(AF123,_Afg07,Udbyttenr4)))","v":""},{"$f":"IF(G123=\"\",\"\",IF(AF123>1,IF(VLOOKUP(AF123,_Afg07,3)<>\"\",VLOOKUP(AF123,_Afg07,3),\"\"),\"\"))","v":""},null,"hkg",null,null,null,null,null,null,null,null,null,null,null,null,null,null,null,null,null,null,null,null,{"$f":"A123","v":4},1,{"$f":"IF(AND(AF123>1,AH123=0),1,0)","v":0},{"$f":"IF(AND(E123<>\"\",VLOOKUP(AF123,_Afg07,3)<>\"\"),E123,0)","v":0},{"$f":"IF(AND(AF123>1,VLOOKUP(AF123,_Afg07,3)=\"\"),1,0)","v":0},{"$f":"IF(AND(E123<>\"\",AF123>1,VLOOKUP(AF123,_Afg07,3)=\"\"),E123,0)","v":0},null,null,1,"","",0,0]
[null,null,null,null,null,null,null,null,null,null,null,null,null,null,null,null,null,null,null,null,null,null,null,null,null,null,null,null,null,null,null,null,null,null,null,null,null,null,0,0,0,0,0]
[null,null,{"$f":"IF(E125>0,\"\",IF(E123>0,\"\",IF(AND(AF125>1,AI123+AI125=0),Fordelt_areal3/2,IF(AF125>1,Fordelt_areal3,\"\"))))","v":""},{"$f":"IF(C125<>\"\",\"ha\",\"\")","v":""},null,"ha",{"$f":"IF(I125<>\"\",\"\",IF(VLOOKUP(AF125,_Afg07,Udbyttenr4)=0,\"\",VLOOKUP(AF125,_Afg07,Udbyttenr4)))","v":""},{"$f":"IF(G125=\"\",\"\",IF(AF125>1,IF(VLOOKUP(AF125,_Afg07,3)<>\"\",VLOOKUP(AF125,_Afg07,3),\"\"),\"\"))","v":""},null,"hkg",null,null,null,null,null,null,null,null,null,null,null,null,null,null,null,null,null,null,null,null,null,1,null,{"$f":"IF(AND(E125<>\"\",VLOOKUP(AF125,_Afg07,3)<>\"\"),E125,0)","v":0},{"$f":"IF(AND(AF125>1,VLOOKUP(AF125,_Afg07,3)=\"\"),1,0)","v":0},{"$f":"IF(AND(E125<>\"\",AF125>1,VLOOKUP(AF125,_Afg07,3)=\"\"),E125,0)","v":0},null,null,1,"","",0,0]
[null,null,null,null,null,null,null,null,null,null,null,null,null,null,null,null,null,null,null,null,null,null,null,null,null,null,null,null,null,null,null,null,null,null,null,null,null,null,0,0,0,0,0]
[null,null,null,null,null,null,null,null,null,null,null,null,null,null,null,null,null,null,null,null,null,null,null,null,null,null,null,null,null,null,null,null,null,null,null,null,null,null,0,0,0,0,0]
[5,null,{"$f":"IF(E128>0,\"\",IF(AND(AF128>1,AF130>1,AI128+AI130=0),Fordelt_areal3/2,IF(AF128>1,Fordelt_areal3,\"\")))","v":""},{"$f":"IF(C128<>\"\",\"ha\",\"\")","v":""},null,"ha",{"$f":"IF(I128<>\"\",\"\",IF(VLOOKUP(AF128,_Afg07,Udbyttenr4)=0,\"\",VLOOKUP(AF128,_Afg07,Udbyttenr4)))","v":""},{"$f":"IF(G128=\"\",\"\",IF(AF128>1,IF(VLOOKUP(AF128,_Afg07,3)<>\"\",VLOOKUP(AF128,_Afg07,3),\"\"),\"\"))","v":""},null,"hkg",null,null,null,null,null,null,null,null,null,null,null,null,null,null,null,null,null,null,null,null,{"$f":"A128","v":5},1,{"$f":"IF(AND(AF128>1,AH128=0),1,0)","v":0},{"$f":"IF(AND(E128<>\"\",VLOOKUP(AF128,_Afg07,3)<>\"\"),E128,0)","v":0},{"$f":"IF(AND(AF128>1,VLOOKUP(AF128,_Afg07,3)=\"\"),1,0)","v":0},{"$f":"IF(AND(E128<>\"\",AF128>1,VLOOKUP(AF128,_Afg07,3)=\"\"),E128,0)","v":0},null,null,1,"","",0,0]
[null,null,null,null,null,null,null,null,null,null,null,null,null,null,null,null,null,null,null,null,null,null,null,null,null,null,null,null,null,null,null,null,null,null,null,null,null,null,0,0,0,0,0]
[null,null,{"$f":"IF(E130>0,\"\",IF(E128>0,\"\",IF(AND(AF130>1,AI128+AI130=0),Fordelt_areal3/2,IF(AF130>1,Fordelt_areal3,\"\"))))","v":""},{"$f":"IF(C130<>\"\",\"ha\",\"\")","v":""},null,"ha",{"$f":"IF(I130<>\"\",\"\",IF(VLOOKUP(AF130,_Afg07,Udbyttenr4)=0,\"\",VLOOKUP(AF130,_Afg07,Udbyttenr4)))","v":""},{"$f":"IF(G130=\"\",\"\",IF(AF130>1,IF(VLOOKUP(AF130,_Afg07,3)<>\"\",VLOOKUP(AF130,_Afg07,3),\"\"),\"\"))","v":""},null,"hkg",null,null,null,null,null,null,null,null,null,null,null,null,null,null,null,null,null,null,null,null,null,1,null,{"$f":"IF(AND(E130<>\"\",VLOOKUP(AF130,_Afg07,3)<>\"\"),E130,0)","v":0},{"$f":"IF(AND(AF130>1,VLOOKUP(AF130,_Afg07,3)=\"\"),1,0)","v":0},{"$f":"IF(AND(E130<>\"\",AF130>1,VLOOKUP(AF130,_Afg07,3)=\"\"),E130,0)","v":0},null,null,1,"","",0,0]
[null,null,null,null,null,null,null,null,null,null,null,null,null,null,null,null,null,null,null,null,null,null,null,null,null,null,null,null,null,null,null,null,null,null,null,null,null,null,0,0,0,0,0]
[null,null,null,null,null,null,null,null,null,null,null,null,null,null,null,null,null,null,null,null,null,null,null,null,null,null,null,null,null,null,null,null,null,null,null,null,null,null,0,0,0,0,0]
[6,null,{"$f":"IF(E133>0,\"\",IF(AND(AF133>1,AF135>1,AI133+AI135=0),Fordelt_areal3/2,IF(AF133>1,Fordelt_areal3,\"\")))","v":""},{"$f":"IF(C133<>\"\",\"ha\",\"\")","v":""},null,"ha",{"$f":"IF(I133<>\"\",\"\",IF(VLOOKUP(AF133,_Afg07,Udbyttenr4)=0,\"\",VLOOKUP(AF133,_Afg07,Udbyttenr4)))","v":""},{"$f":"IF(G133=\"\",\"\",IF(AF133>1,IF(VLOOKUP(AF133,_Afg07,3)<>\"\",VLOOKUP(AF133,_Afg07,3),\"\"),\"\"))","v":""},null,"hkg",null,null,null,null,null,null,null,null,null,null,null,null,null,null,null,null,null,null,null,null,{"$f":"A133","v":6},1,{"$f":"IF(AND(AF133>1,AH133=0),1,0)","v":0},{"$f":"IF(AND(E133<>\"\",VLOOKUP(AF133,_Afg07,3)<>\"\"),E133,0)","v":0},{"$f":"IF(AND(AF133>1,VLOOKUP(AF133,_Afg07,3)=\"\"),1,0)","v":0},{"$f":"IF(AND(E133<>\"\",AF133>1,VLOOKUP(AF133,_Afg07,3)=\"\"),E133,0)","v":0},null,null,1,"","",0,0]
[null,null,null,null,null,null,null,null,null,null,null,null,null,null,null,null,null,null,null,null,null,null,null,null,null,null,null,null,null,null,null,null,null,null,null,null,null,null,0,0,0,0,0]
[null,null,{"$f":"IF(E135>0,\"\",IF(E133>0,\"\",IF(AND(AF135>1,AI133+AI135=0),Fordelt_areal3/2,IF(AF135>1,Fordelt_areal3,\"\"))))","v":""},{"$f":"IF(C135<>\"\",\"ha\",\"\")","v":""},null,"ha",{"$f":"IF(I135<>\"\",\"\",IF(VLOOKUP(AF135,_Afg07,Udbyttenr4)=0,\"\",VLOOKUP(AF135,_Afg07,Udbyttenr4)))","v":""},{"$f":"IF(G135=\"\",\"\",IF(AF135>1,IF(VLOOKUP(AF135,_Afg07,3)<>\"\",VLOOKUP(AF135,_Afg07,3),\"\"),\"\"))","v":""},null,"hkg",null,null,null,null,null,null,null,null,null,null,null,null,null,null,null,null,null,null,null,null,null,1,null,{"$f":"IF(AND(E135<>\"\",VLOOKUP(AF135,_Afg07,3)<>\"\"),E135,0)","v":0},{"$f":"IF(AND(AF135>1,VLOOKUP(AF135,_Afg07,3)=\"\"),1,0)","v":0},{"$f":"IF(AND(E135<>\"\",AF135>1,VLOOKUP(AF135,_Afg07,3)=\"\"),E135,0)","v":0},null,null,1,"","",0,0]
[null,null,null,null,null,null,null,null,null,null,null,null,null,null,null,null,null,null,null,null,null,null,null,null,null,null,null,null,null,null,null,null,null,null,null,null,null,null,0,0,0,0,0]
[null,null,null,null,null,null,null,null,null,null,null,null,null,null,null,null,null,null,null,null,null,null,null,null,null,null,null,null,null,null,null,null,null,null,null,null,null,null,0,0,0,0,0]
[7,null,{"$f":"IF(E138>0,\"\",IF(AND(AF138>1,AF140>1,AI138+AI140=0),Fordelt_areal3/2,IF(AF138>1,Fordelt_areal3,\"\")))","v":""},{"$f":"IF(C138<>\"\",\"ha\",\"\")","v":""},null,"ha",{"$f":"IF(I138<>\"\",\"\",IF(VLOOKUP(AF138,_Afg07,Udbyttenr4)=0,\"\",VLOOKUP(AF138,_Afg07,Udbyttenr4)))","v":""},{"$f":"IF(G138=\"\",\"\",IF(AF138>1,IF(VLOOKUP(AF138,_Afg07,3)<>\"\",VLOOKUP(AF138,_Afg07,3),\"\"),\"\"))","v":""},null,"hkg",null,null,null,null,null,null,null,null,null,null,null,null,null,null,null,null,null,null,null,null,{"$f":"A138","v":7},1,{"$f":"IF(AND(AF138>1,AH138=0),1,0)","v":0},{"$f":"IF(AND(E138<>\"\",VLOOKUP(AF138,_Afg07,3)<>\"\"),E138,0)","v":0},{"$f":"IF(AND(AF138>1,VLOOKUP(AF138,_Afg07,3)=\"\"),1,0)","v":0},{"$f":"IF(AND(E138<>\"\",AF138>1,VLOOKUP(AF138,_Afg07,3)=\"\"),E138,0)","v":0},null,null,1,"","",0,0]
[null,null,null,null,null,null,null,null,null,null,null,null,null,null,null,null,null,null,null,null,null,null,null,null,null,null,null,null,null,null,null,null,null,null,null,null,null,null,0,0,0,0,0]
[null,null,{"$f":"IF(E140>0,\"\",IF(E138>0,\"\",IF(AND(AF140>1,AI138+AI140=0),Fordelt_areal3/2,IF(AF140>1,Fordelt_areal3,\"\"))))","v":""},{"$f":"IF(C140<>\"\",\"ha\",\"\")","v":""},null,"ha",{"$f":"IF(I140<>\"\",\"\",IF(VLOOKUP(AF140,_Afg07,Udbyttenr4)=0,\"\",VLOOKUP(AF140,_Afg07,Udbyttenr4)))","v":""},{"$f":"IF(G140=\"\",\"\",IF(AF140>1,IF(VLOOKUP(AF140,_Afg07,3)<>\"\",VLOOKUP(AF140,_Afg07,3),\"\"),\"\"))","v":""},null,"hkg",null,null,null,null,null,null,null,null,null,null,null,null,null,null,null,null,null,null,null,null,null,1,null,{"$f":"IF(AND(E140<>\"\",VLOOKUP(AF140,_Afg07,3)<>\"\"),E140,0)","v":0},{"$f":"IF(AND(AF140>1,VLOOKUP(AF140,_Afg07,3)=\"\"),1,0)","v":0},{"$f":"IF(AND(E140<>\"\",AF140>1,VLOOKUP(AF140,_Afg07,3)=\"\"),E140,0)","v":0},null,null,1,"","",0,0]
[]
[null,null,null,null,null,null,null,null,null,null,null,null,null,null,null,null,null,null,null,null,null,null,null,null,null,null,null,null,null,null,"Sum",null,{"$f":"AG108+AG110+AG113+AG115+AG118+AG120+AG123+AG125+AG128+AG130+AG133+AG135+AG138+AG140","v":0},{"$f":"AH108+AH110+AH113+AH115+AH118+AH120+AH123+AH125+AH128+AH130+AH133+AH135+AH138+AH140","v":0},null,{"$f":"AJ108+AJ110+AJ113+AJ115+AJ118+AJ120+AJ123+AJ125+AJ128+AJ130+AJ133+AJ135+AJ138+AJ140","v":0}]
["Samlet produktion",null,null,null,null,null,null,null,null,null,null,null,null,null,null,null,null,null,null,null,null,null,null,null,null,null,null,null,null,null,null,null,null,null,"Foderproduktion fordelt på korntyper"]
[null,null,null,null,null,null,null,null,null,null,null,null,null,null,null,null,null,null,null,null,null,null,null,null,null,null,null,null,null,null,null,null,null,null,"Hvede",null,"Byg",null,"Havre",null,"Rug",null,"Triticale",null,"Majs",null,null,null,"Areal med efterafgrøder"]
[null,"Afgrøder","Areal",null,"Gns. udbytte",null,null,"Udbytte i alt",null,"Foderudbytte",null,null,null,null,null,null,null,null,null,null,null,null,null,null,null,null,null,null,null,null,null,null,null,null,null,null,null,null,null,null,null,null,null,null,null,null,null,null,null,"Efterafgrøde"]
[null,null,null,null,null,null,null,null,null,null,null,null,null,null,null,null,null,null,null,null,null,null,null,null,null,null,null,null,null,null,null,"Afgnr","Foderudbytte",null,"Hkg","Fesv","Hkg","Fesv","Hkg","Fesv","Hkg","Fesv","Hkg","Fesv","Hkg","Fesv",null,null,null,1]
[null,null,{"$f":"IF(AF147>1,IF(DSUM(Base,2,$AF146:$AF147)=0,\"\",DSUM(Base,2,$AF146:$AF147)))","v":false},{"$f":"IF(C147=\"\",\"\",\"ha\")","v":"ha"},{"$f":"IF(ISERROR(G147/C147),\"\",G147/C147)","v":""},{"$f":"IF(E147=\"\",\"\",\"hkg\")","v":""},{"$f":"IF(DSUM(Base,4,$AF146:$AF147)=0,\"\",DSUM(Base,4,$AF146:$AF147))","v":""},null,{"$f":"IF(G147=\"\",\"\",\"hkg\")","v":""},{"$f":"IF(ISERROR(G147*VLOOKUP(AF147,_Afg07,'Ark1'!$BT$285)),\"\",G147*VLOOKUP(AF147,_Afg07,'Ark1'!$BT$285))","v":""},null,{"$f":"IF(J147=\"\",\"\",\"FEsv\")","v":""},null,null,null,null,null,null,null,null,null,null,null,null,null,null,null,null,null,null,null,1,{"$f":"IF(J147<>\"\",J147,0)","v":0},null,{"$f":"IF(VLOOKUP($AF147,_Afg07,'Ark1'!$CK$285)=\"Hvede\",$G147,0)","v":0},{"$f":"IF(VLOOKUP($AF147,_Afg07,'Ark1'!$CK$285)=\"Hvede\",$J147,0)","v":0},{"$f":"IF(VLOOKUP($AF147,_Afg07,'Ark1'!$CK$285)=\"Byg\",$G147,0)","v":0},{"$f":"IF(VLOOKUP($AF147,_Afg07,'Ark1'!$CK$285)=\"Byg\",$J147,0)","v":0},{"$f":"IF(VLOOKUP($AF147,_Afg07,'Ark1'!$CK$285)=\"Havre\",$G147,0)","v":0},{"$f":"IF(VLOOKUP($AF147,_Afg07,'Ark1'!$CK$285)=\"Havre\",$J147,0)","v":0},{"$f":"IF(VLOOKUP($AF147,_Afg07,'Ark1'!$CK$285)=\"Rug\",$G147,0)","v":0},{"$f":"IF(VLOOKUP($AF147,_Afg07,'Ark1'!$CK$285)=\"Rug\",$J147,0)","v":0},{"$f":"IF(VLOOKUP($AF147,_Afg07,'Ark1'!$CK$285)=\"Triticale\",$G147,0)","v":0},{"$f":"IF(VLOOKUP($AF147,_Afg07,'Ark1'!$CK$285)=\"Triticale\",$J147,0)","v":0},{"$f":"IF(VLOOKUP($AF147,_Afg07,'Ark1'!$CK$285)=\"Majs\",$G147,0)","v":0},{"$f":"IF(VLOOKUP($AF147,_Afg07,'Ark1'!$CK$285)=\"Majs\",$J147,0)","v":0},null,null,null,{"$f":"DSUM(Base,2,AX145:AX146)","v":0}]
[null,null,null,null,null,null,null,null,null,null,null,null,null,null,null,null,null,null,null,null,null,null,null,null,null,null,null,null,null,null,null,"Afgnr",null,null,null,null,null,null,null,null,null,null,null,null,null,null,null,null,null,{"$f":"IF(ISERROR(AX147*100/C310),\"\",ROUND(AX147*100/C310,1))","v":""}]
[null,null,{"$f":"IF(AF149>1,IF(DSUM(Base,2,$AF148:$AF149)=0,\"\",DSUM(Base,2,$AF148:$AF149)),\"\")","v":""},{"$f":"IF(C149=\"\",\"\",\"ha\")","v":""},{"$f":"IF(ISERROR(G149/C149),\"\",G149/C149)","v":""},{"$f":"IF(E149=\"\",\"\",\"hkg\")","v":""},{"$f":"IF(DSUM(Base,4,$AF148:$AF149)=0,\"\",DSUM(Base,4,$AF148:$AF149))","v":""},null,{"$f":"IF(G149=\"\",\"\",\"hkg\")","v":""},{"$f":"IF(ISERROR(G149*VLOOKUP(AF149,_Afg07,'Ark1'!$BT$285)),\"\",G149*VLOOKUP(AF149,_Afg07,'Ark1'!$BT$285))","v":""},null,{"$f":"IF(J149=\"\",\"\",\"FEsv\")","v":""},null,null,null,null,null,null,null,null,null,null,null,null,null,null,null,null,null,null,null,1,{"$f":"IF(J149<>\"\",J149,0)","v":0},null,{"$f":"IF(VLOOKUP($AF149,_Afg07,'Ark1'!$CK$285)=\"Hvede\",$G149,0)","v":0},{"$f":"IF(VLOOKUP($AF149,_Afg07,'Ark1'!$CK$285)=\"Hvede\",$J149,0)","v":0},{"$f":"IF(VLOOKUP($AF149,_Afg07,'Ark1'!$CK$285)=\"Byg\",$G149,0)","v":0},{"$f":"IF(VLOOKUP($AF149,_Afg07,'Ark1'!$CK$285)=\"Byg\",$J149,0)","v":0},{"$f":"IF(VLOOKUP($AF149,_Afg07,'Ark1'!$CK$285)=\"Havre\",$G149,0)","v":0},{"$f":"IF(VLOOKUP($AF149,_Afg07,'Ark1'!$CK$285)=\"Havre\",$J149,0)","v":0},{"$f":"IF(VLOOKUP($AF149,_Afg07,'Ark1'!$CK$285)=\"Rug\",$G149,0)","v":0},{"$f":"IF(VLOOKUP($AF149,_Afg07,'Ark1'!$CK$285)=\"Rug\",$J149,0)","v":0},{"$f":"IF(VLOOKUP($AF149,_Afg07,'Ark1'!$CK$285)=\"Triticale\",$G149,0)","v":0},{"$f":"IF(VLOOKUP($AF149,_Afg07,'Ark1'!$CK$285)=\"Triticale\",$J149,0)","v":0},{"$f":"IF(VLOOKUP($AF149,_Afg07,'Ark1'!$CK$285)=\"Majs\",$G149,0)","v":0},{"$f":"IF(VLOOKUP($AF149,_Afg07,'Ark1'!$CK$285)=\"Majs\",$J149,0)","v":0}]
[null,null,null,null,null,null,null,null,null,null,null,null,null,null,null,null,null,null,null,null,null,null,null,null,null,null,null,null,null,null,null,"Afgnr"]
[null,null,{"$f":"IF(AF151>1,IF(DSUM(Base,2,$AF150:$AF151)=0,\"\",DSUM(Base,2,$AF150:$AF151)),\"\")","v":""},{"$f":"IF(C151=\"\",\"\",\"ha\")","v":""},{"$f":"IF(ISERROR(G151/C151),\"\",G151/C151)","v":""},{"$f":"IF(E151=\"\",\"\",\"hkg\")","v":""},{"$f":"IF(DSUM(Base,4,$AF150:$AF151)=0,\"\",DSUM(Base,4,$AF150:$AF151))","v":""},null,{"$f":"IF(G151=\"\",\"\",\"hkg\")","v":""},{"$f":"IF(ISERROR(G151*VLOOKUP(AF151,_Afg07,'Ark1'!$BT$285)),\"\",G151*VLOOKUP(AF151,_Afg07,'Ark1'!$BT$285))","v":""},null,{"$f":"IF(J151=\"\",\"\",\"FEsv\")","v":""},null,null,null,null,null,null,null,null,null,null,null,null,null,null,null,null,null,null,null,1,{"$f":"IF(J151<>\"\",J151,0)","v":0},null,{"$f":"IF(VLOOKUP($AF151,_Afg07,'Ark1'!$CK$285)=\"Hvede\",$G151,0)","v":0},{"$f":"IF(VLOOKUP($AF151,_Afg07,'Ark1'!$CK$285)=\"Hvede\",$J151,0)","v":0},{"$f":"IF(VLOOKUP($AF151,_Afg07,'Ark1'!$CK$285)=\"Byg\",$G151,0)","v":0},{"$f":"IF(VLOOKUP($AF151,_Afg07,'Ark1'!$CK$285)=\"Byg\",$J151,0)","v":0},{"$f":"IF(VLOOKUP($AF151,_Afg07,'Ark1'!$CK$285)=\"Havre\",$G151,0)","v":0},{"$f":"IF(VLOOKUP($AF151,_Afg07,'Ark1'!$CK$285)=\"Havre\",$J151,0)","v":0},{"$f":"IF(VLOOKUP($AF151,_Afg07,'Ark1'!$CK$285)=\"Rug\",$G151,0)","v":0},{"$f":"IF(VLOOKUP($AF151,_Afg07,'Ark1'!$CK$285)=\"Rug\",$J151,0)","v":0},{"$f":"IF(VLOOKUP($AF151,_Afg07,'Ark1'!$CK$285)=\"Triticale\",$G151,0)","v":0},{"$f":"IF(VLOOKUP($AF151,_Afg07,'Ark1'!$CK$285)=\"Triticale\",$J151,0)","v":0},{"$f":"IF(VLOOKUP($AF151,_Afg07,'Ark1'!$CK$285)=\"Majs\",$G151,0)","v":0},{"$f":"IF(VLOOKUP($AF151,_Afg07,'Ark1'!$CK$285)=\"Majs\",$J151,0)","v":0}]
[null,null,null,null,null,null,null,null,null,null,null,null,null,null,null,null,null,null,null,null,null,null,null,null,null,null,null,null,null,null,null,"Afgnr"]
[null,null,{"$f":"IF(AF153>1,IF(DSUM(Base,2,$AF152:$AF153)=0,\"\",DSUM(Base,2,$AF152:$AF153)),\"\")","v":""},{"$f":"IF(C153=\"\",\"\",\"ha\")","v":""},{"$f":"IF(ISERROR(G153/C153),\"\",G153/C153)","v":""},{"$f":"IF(E153=\"\",\"\",\"hkg\")","v":""},{"$f":"IF(DSUM(Base,4,$AF152:$AF153)=0,\"\",DSUM(Base,4,$AF152:$AF153))","v":""},null,{"$f":"IF(G153=\"\",\"\",\"hkg\")","v":""},{"$f":"IF(ISERROR(G153*VLOOKUP(AF153,_Afg07,'Ark1'!$BT$285)),\"\",G153*VLOOKUP(AF153,_Afg07,'Ark1'!$BT$285))","v":""},null,{"$f":"IF(J153=\"\",\"\",\"FEsv\")","v":""},null,null,null,null,null,null,null,null,null,null,null,null,null,null,null,null,null,null,null,1,{"$f":"IF(J153<>\"\",J153,0)","v":0},null,{"$f":"IF(VLOOKUP($AF153,_Afg07,'Ark1'!$CK$285)=\"Hvede\",$G153,0)","v":0},{"$f":"IF(VLOOKUP($AF153,_Afg07,'Ark1'!$CK$285)=\"Hvede\",$J153,0)","v":0},{"$f":"IF(VLOOKUP($AF153,_Afg07,'Ark1'!$CK$285)=\"Byg\",$G153,0)","v":0},{"$f":"IF(VLOOKUP($AF153,_Afg07,'Ark1'!$CK$285)=\"Byg\",$J153,0)","v":0},{"$f":"IF(VLOOKUP($AF153,_Afg07,'Ark1'!$CK$285)=\"Havre\",$G153,0)","v":0},{"$f":"IF(VLOOKUP($AF153,_Afg07,'Ark1'!$CK$285)=\"Havre\",$J153,0)","v":0},{"$f":"IF(VLOOKUP($AF153,_Afg07,'Ark1'!$CK$285)=\"Rug\",$G153,0)","v":0},{"$f":"IF(VLOOKUP($AF153,_Afg07,'Ark1'!$CK$285)=\"Rug\",$J153,0)","v":0},{"$f":"IF(VLOOKUP($AF153,_Afg07,'Ark1'!$CK$285)=\"Triticale\",$G153,0)","v":0},{"$f":"IF(VLOOKUP($AF153,_Afg07,'Ark1'!$CK$285)=\"Triticale\",$J153,0)","v":0},{"$f":"IF(VLOOKUP($AF153,_Afg07,'Ark1'!$CK$285)=\"Majs\",$G153,0)","v":0},{"$f":"IF(VLOOKUP($AF153,_Afg07,'Ark1'!$CK$285)=\"Majs\",$J153,0)","v":0}]
[null,null,null,null,null,null,null,null,null,null,null,null,null,null,null,null,null,null,null,null,null,null,null,null,null,null,null,null,null,null,null,"Afgnr"]
[null,null,{"$f":"IF(AF155>1,IF(DSUM(Base,2,$AF154:$AF155)=0,\"\",DSUM(Base,2,$AF154:$AF155)),\"\")","v":""},{"$f":"IF(C155=\"\",\"\",\"ha\")","v":""},{"$f":"IF(ISERROR(G155/C155),\"\",G155/C155)","v":""},{"$f":"IF(E155=\"\",\"\",\"hkg\")","v":""},{"$f":"IF(DSUM(Base,4,$AF154:$AF155)=0,\"\",DSUM(Base,4,$AF154:$AF155))","v":""},null,{"$f":"IF(G155=\"\",\"\",\"hkg\")","v":""},{"$f":"IF(ISERROR(G155*VLOOKUP(AF155,_Afg07,'Ark1'!$BT$285)),\"\",G155*VLOOKUP(AF155,_Afg07,'Ark1'!$BT$285))","v":""},null,{"$f":"IF(J155=\"\",\"\",\"FEsv\")","v":""},null,null,null,null,null,null,null,null,null,null,null,null,null,null,null,null,null,null,null,1,{"$f":"IF(J155<>\"\",J155,0)","v":0},null,{"$f":"IF(VLOOKUP($AF155,_Afg07,'Ark1'!$CK$285)=\"Hvede\",$G155,0)","v":0},{"$f":"IF(VLOOKUP($AF155,_Afg07,'Ark1'!$CK$285)=\"Hvede\",$J155,0)","v":0},{"$f":"IF(VLOOKUP($AF155,_Afg07,'Ark1'!$CK$285)=\"Byg\",$G155,0)","v":0},{"$f":"IF(VLOOKUP($AF155,_Afg07,'Ark1'!$CK$285)=\"Byg\",$J155,0)","v":0},{"$f":"IF(VLOOKUP($AF155,_Afg07,'Ark1'!$CK$285)=\"Havre\",$G155,0)","v":0},{"$f":"IF(VLOOKUP($AF155,_Afg07,'Ark1'!$CK$285)=\"Havre\",$J155,0)","v":0},{"$f":"IF(VLOOKUP($AF155,_Afg07,'Ark1'!$CK$285)=\"Rug\",$G155,0)","v":0},{"$f":"IF(VLOOKUP($AF155,_Afg07,'Ark1'!$CK$285)=\"Rug\",$J155,0)","v":0},{"$f":"IF(VLOOKUP($AF155,_Afg07,'Ark1'!$CK$285)=\"Triticale\",$G155,0)","v":0},{"$f":"IF(VLOOKUP($AF155,_Afg07,'Ark1'!$CK$285)=\"Triticale\",$J155,0)","v":0},{"$f":"IF(VLOOKUP($AF155,_Afg07,'Ark1'!$CK$285)=\"Majs\",$G155,0)","v":0},{"$f":"IF(VLOOKUP($AF155,_Afg07,'Ark1'!$CK$285)=\"Majs\",$J155,0)","v":0}]
[null,null,null,null,null,null,null,null,null,null,null,null,null,null,null,null,null,null,null,null,null,null,null,null,null,null,null,null,null,null,null,"Afgnr"]
[null,null,{"$f":"IF(AF157>1,IF(DSUM(Base,2,$AF156:$AF157)=0,\"\",DSUM(Base,2,$AF156:$AF157)),\"\")","v":""},{"$f":"IF(C157=\"\",\"\",\"ha\")","v":""},{"$f":"IF(ISERROR(G157/C157),\"\",G157/C157)","v":""},{"$f":"IF(E157=\"\",\"\",\"hkg\")","v":""},{"$f":"IF(DSUM(Base,4,$AF156:$AF157)=0,\"\",DSUM(Base,4,$AF156:$AF157))","v":""},null,{"$f":"IF(G157=\"\",\"\",\"hkg\")","v":""},{"$f":"IF(ISERROR(G157*VLOOKUP(AF157,_Afg07,'Ark1'!$BT$285)),\"\",G157*VLOOKUP(AF157,_Afg07,'Ark1'!$BT$285))","v":""},null,{"$f":"IF(J157=\"\",\"\",\"FEsv\")","v":""},null,null,null,null,null,null,null,null,null,null,null,null,null,null,null,null,null,null,null,1,{"$f":"IF(J157<>\"\",J157,0)","v":0},null,{"$f":"IF(VLOOKUP($AF157,_Afg07,'Ark1'!$CK$285)=\"Hvede\",$G157,0)","v":0},{"$f":"IF(VLOOKUP($AF157,_Afg07,'Ark1'!$CK$285)=\"Hvede\",$J157,0)","v":0},{"$f":"IF(VLOOKUP($AF157,_Afg07,'Ark1'!$CK$285)=\"Byg\",$G157,0)","v":0},{"$f":"IF(VLOOKUP($AF157,_Afg07,'Ark1'!$CK$285)=\"Byg\",$J157,0)","v":0},{"$f":"IF(VLOOKUP($AF157,_Afg07,'Ark1'!$CK$285)=\"Havre\",$G157,0)","v":0},{"$f":"IF(VLOOKUP($AF157,_Afg07,'Ark1'!$CK$285)=\"Havre\",$J157,0)","v":0},{"$f":"IF(VLOOKUP($AF157,_Afg07,'Ark1'!$CK$285)=\"Rug\",$G157,0)","v":0},{"$f":"IF(VLOOKUP($AF157,_Afg07,'Ark1'!$CK$285)=\"Rug\",$J157,0)","v":0},{"$f":"IF(VLOOKUP($AF157,_Afg07,'Ark1'!$CK$285)=\"Triticale\",$G157,0)","v":0},{"$f":"IF(VLOOKUP($AF157,_Afg07,'Ark1'!$CK$285)=\"Triticale\",$J157,0)","v":0},{"$f":"IF(VLOOKUP($AF157,_Afg07,'Ark1'!$CK$285)=\"Majs\",$G157,0)","v":0},{"$f":"IF(VLOOKUP($AF157,_Afg07,'Ark1'!$CK$285)=\"Majs\",$J157,0)","v":0}]
[null,null,null,null,null,null,null,null,null,null,null,null,null,null,null,null,null,null,null,null,null,null,null,null,null,null,null,null,null,null,null,"Afgnr"]
[null,null,{"$f":"IF(AF159>1,IF(DSUM(Base,2,$AF158:$AF159)=0,\"\",DSUM(Base,2,$AF158:$AF159)),\"\")","v":""},{"$f":"IF(C159=\"\",\"\",\"ha\")","v":""},{"$f":"IF(ISERROR(G159/C159),\"\",G159/C159)","v":""},{"$f":"IF(E159=\"\",\"\",\"hkg\")","v":""},{"$f":"IF(DSUM(Base,4,$AF158:$AF159)=0,\"\",DSUM(Base,4,$AF158:$AF159))","v":""},null,{"$f":"IF(G159=\"\",\"\",\"hkg\")","v":""},{"$f":"IF(ISERROR(G159*VLOOKUP(AF159,_Afg07,'Ark1'!$BT$285)),\"\",G159*VLOOKUP(AF159,_Afg07,'Ark1'!$BT$285))","v":""},null,{"$f":"IF(J159=\"\",\"\",\"FEsv\")","v":""},null,null,null,null,null,null,null,null,null,null,null,null,null,null,null,null,null,null,null,1,{"$f":"IF(J159<>\"\",J159,0)","v":0},null,{"$f":"IF(VLOOKUP($AF159,_Afg07,'Ark1'!$CK$285)=\"Hvede\",$G159,0)","v":0},{"$f":"IF(VLOOKUP($AF159,_Afg07,'Ark1'!$CK$285)=\"Hvede\",$J159,0)","v":0},{"$f":"IF(VLOOKUP($AF159,_Afg07,'Ark1'!$CK$285)=\"Byg\",$G159,0)","v":0},{"$f":"IF(VLOOKUP($AF159,_Afg07,'Ark1'!$CK$285)=\"Byg\",$J159,0)","v":0},{"$f":"IF(VLOOKUP($AF159,_Afg07,'Ark1'!$CK$285)=\"Havre\",$G159,0)","v":0},{"$f":"IF(VLOOKUP($AF159,_Afg07,'Ark1'!$CK$285)=\"Havre\",$J159,0)","v":0},{"$f":"IF(VLOOKUP($AF159,_Afg07,'Ark1'!$CK$285)=\"Rug\",$G159,0)","v":0},{"$f":"IF(VLOOKUP($AF159,_Afg07,'Ark1'!$CK$285)=\"Rug\",$J159,0)","v":0},{"$f":"IF(VLOOKUP($AF159,_Afg07,'Ark1'!$CK$285)=\"Triticale\",$G159,0)","v":0},{"$f":"IF(VLOOKUP($AF159,_Afg07,'Ark1'!$CK$285)=\"Triticale\",$J159,0)","v":0},{"$f":"IF(VLOOKUP($AF159,_Afg07,'Ark1'!$CK$285)=\"Majs\",$G159,0)","v":0},{"$f":"IF(VLOOKUP($AF159,_Afg07,'Ark1'!$CK$285)=\"Majs\",$J159,0)","v":0}]
[null,null,null,null,null,null,null,null,null,"",null,null,null,null,null,null,null,null,null,null,null,null,null,null,null,null,null,null,null,null,null,"Afgnr"]
[null,null,{"$f":"IF(AF161>1,IF(DSUM(Base,2,$AF160:$AF161)=0,\"\",DSUM(Base,2,$AF160:$AF161)),\"\")","v":""},{"$f":"IF(C161=\"\",\"\",\"ha\")","v":""},{"$f":"IF(ISERROR(G161/C161),\"\",G161/C161)","v":""},{"$f":"IF(E161=\"\",\"\",\"hkg\")","v":""},{"$f":"IF(DSUM(Base,4,$AF160:$AF161)=0,\"\",DSUM(Base,4,$AF160:$AF161))","v":""},null,{"$f":"IF(G161=\"\",\"\",\"hkg\")","v":""},{"$f":"IF(ISERROR(G161*VLOOKUP(AF161,_Afg07,'Ark1'!$BT$285)),\"\",G161*VLOOKUP(AF161,_Afg07,'Ark1'!$BT$285))","v":""},null,{"$f":"IF(J161=\"\",\"\",\"FEsv\")","v":""},null,null,null,null,null,null,null,null,null,null,null,null,null,null,null,null,null,null,null,1,{"$f":"IF(J161<>\"\",J161,0)","v":0},null,{"$f":"IF(VLOOKUP($AF161,_Afg07,'Ark1'!$CK$285)=\"Hvede\",$G161,0)","v":0},{"$f":"IF(VLOOKUP($AF161,_Afg07,'Ark1'!$CK$285)=\"Hvede\",$J161,0)","v":0},{"$f":"IF(VLOOKUP($AF161,_Afg07,'Ark1'!$CK$285)=\"Byg\",$G161,0)","v":0},{"$f":"IF(VLOOKUP($AF161,_Afg07,'Ark1'!$CK$285)=\"Byg\",$J161,0)","v":0},{"$f":"IF(VLOOKUP($AF161,_Afg07,'Ark1'!$CK$285)=\"Havre\",$G161,0)","v":0},{"$f":"IF(VLOOKUP($AF161,_Afg07,'Ark1'!$CK$285)=\"Havre\",$J161,0)","v":0},{"$f":"IF(VLOOKUP($AF161,_Afg07,'Ark1'!$CK$285)=\"Rug\",$G161,0)","v":0},{"$f":"IF(VLOOKUP($AF161,_Afg07,'Ark1'!$CK$285)=\"Rug\",$J161,0)","v":0},{"$f":"IF(VLOOKUP($AF161,_Afg07,'Ark1'!$CK$285)=\"Triticale\",$G161,0)","v":0},{"$f":"IF(VLOOKUP($AF161,_Afg07,'Ark1'!$CK$285)=\"Triticale\",$J161,0)","v":0},{"$f":"IF(VLOOKUP($AF161,_Afg07,'Ark1'!$CK$285)=\"Majs\",$G161,0)","v":0},{"$f":"IF(VLOOKUP($AF161,_Afg07,'Ark1'!$CK$285)=\"Majs\",$J161,0)","v":0}]
[null,null,null,null,null,null,null,null,null,null,null,null,null,null,null,null,null,null,null,null,null,null,null,null,null,null,null,null,null,null,null,"I alt",{"$f":"AG147+AG149+AG151+AG153+AG155+AG157+AG159+AG161","v":0},null,{"$f":"AI147+AI149+AI151+AI153+AI155+AI157+AI159+AI161","v":0},0,0,0,0,0,0,0,0,0,0,0]
[]
["Foderbehov",null,null,null,null,null,null,null,null,null,null,null,null,null,null,null,null,"Andel i kornration (vægtpct.)",null,null,null,null,null,null,null,null,null,null,null,null,null,null,null,null,null,"Hkg af hver kornart"]
[]
[null,"Besætning",null,null,null,null,null,null,null," Foderforbrug",null,null,null,"Kornandel af Fesv",null,null,null,"Byg",null,"Havre",null,"Rug",null,"Triticale",null,"Majs",null,"Hvede",null,null,null,"Foderforbrug_FE","Korn-FE","Gns FE/kg korn","hkg korn","Byg","Havre","Rug","Triticale","Majs","Hvede"]
[]
[null,"Søer m. smågrise",null,"årssøer",null,null,null,null,null,1482,"FE",null,"FE",81,"%",null,"%",50,"%",null,"%",null,"%",null,"%",null,"%",{"$f":"100-R168-T168-V168-X168-Z168","v":50},"%",null,null,{"$f":"C168*IF(L168<>\"\",L168,J168)","v":0},{"$f":"AF168*IF(P168<>\"\",P168,N168)*0.01","v":0},{"$f":"R168*0.01*102+T168*0.01*87+V168*0.01*110+X168*0.01*113+Z168*0.01*122+AB168*0.01*115","v":108.5},{"$f":"AG168/AH168","v":0},{"$f":"$AI168*R168*0.01","v":0},{"$f":"$AI168*T168*0.01","v":0},{"$f":"$AI168*V168*0.01","v":0},{"$f":"$AI168*X168*0.01","v":0},{"$f":"$AI168*Z168*0.01","v":0},{"$f":"$AI168*AB168*0.01","v":0}]
[]
[null,"Smågrise",null,"stk.","Fra ",7,"kg   Til",32,"kg",1.98,"Fesv",null,"Fesv",68,"%",null,"%",22,"%",null,"%",null,"%",null,"%",null,"%",{"$f":"100-R170-T170-V170-X170-Z170","v":78},"%",null,null,{"$f":"C170*(H170-F170)*IF(L170<>\"\",L170,J170)","v":0},{"$f":"AF170*IF(P170<>\"\",P170,N170)*0.01","v":0},{"$f":"R170*0.01*102+T170*0.01*87+V170*0.01*110+X170*0.01*113+Z170*0.01*122+AB170*0.01*115","v":112.14},{"$f":"AG170/AH170","v":0},{"$f":"$AI170*R170*0.01","v":0},{"$f":"$AI170*T170*0.01","v":0},{"$f":"$AI170*V170*0.01","v":0},{"$f":"$AI170*X170*0.01","v":0},{"$f":"$AI170*Z170*0.01","v":0},{"$f":"$AI170*AB170*0.01","v":0}]
[]
[null,"Slagtesvin",null,"stk.","Fra ",32,"kg   Til",107,"kg",2.83,"Fesv",null,"Fesv",78,"%",null,"%",25,"%",null,"%",null,"%",null,"%",null,"%",{"$f":"100-R172-T172-V172-X172-Z172","v":75},"%",null,null,{"$f":"C172*(H172-F172)*IF(L172<>\"\",L172,J172)","v":0},{"$f":"AF172*IF(P172<>\"\",P172,N172)*0.01","v":0},{"$f":"R172*0.01*102+T172*0.01*87+V172*0.01*110+X172*0.01*113+Z172*0.01*122+AB172*0.01*115","v":111.75},{"$f":"AG172/AH172","v":0},{"$f":"$AI172*R172*0.01","v":0},{"$f":"$AI172*T172*0.01","v":0},{"$f":"$AI172*V172*0.01","v":0},{"$f":"$AI172*X172*0.01","v":0},{"$f":"$AI172*Z172*0.01","v":0},{"$f":"$AI172*AB172*0.01","v":0}]
[]
[null,null,null,null,null,null,null,null,null,null,null,null,null,null,null,null,null,null,null,null,null,null,null,null,null,null,null,null,null,null,null,null,null,null,"Sum",{"$f":"AJ168+AJ170+AJ172","v":0},0,0,0,0,0]
[]
["Udskrift"]
[{"$f":"\"Sædskifteplan\"","v":"Sædskifteplan"}]
[]
["Delsædskifte 1"]
[]
["Marker/ejendom:",null,{"$f":"IF(C8<>\"\",C8,\"\")","v":""}]
[]
["Areal sædskifte 1:",null,{"$f":"C12","v":0},{"$f":"IF(C183=\"\",\"\",\"ha\")","v":"ha"},null,{"$f":"VLOOKUP(JBnr2,Jordtyper,2)","v":"JB 5-6"}]
[]
[]
[1,{"$f":"IF(AF16>1,VLOOKUP(AF16,_Afg07,2),\"\")","v":""},{"$f":"IF(AN16>0,AN16,\"\")","v":""},{"$f":"IF(C186=\"\",\"\",\"ha\")","v":""},{"$f":"IF(AO16>0,AO16,\"\")","v":""},{"$f":"IF(E186=\"\",\"\",\"hkg\")","v":""},null,{"$f":"IF(L16=\"\",\"\",L16)","v":""}]
[]
[null,{"$f":"IF(AF18>1,VLOOKUP(AF18,_Afg07,2),\"\")","v":""},{"$f":"IF(AN18>0,AN18,\"\")","v":""},{"$f":"IF(C188=\"\",\"\",\"ha\")","v":""},{"$f":"IF(AO18>0,AO18,\"\")","v":""},{"$f":"IF(E188=\"\",\"\",\"hkg\")","v":""}]
[]
[]
[2,{"$f":"IF(AF21>1,VLOOKUP(AF21,_Afg07,2),\"\")","v":""},{"$f":"IF(AN21>0,AN21,\"\")","v":""},{"$f":"IF(C191=\"\",\"\",\"ha\")","v":""},{"$f":"IF(AO21>0,AO21,\"\")","v":""},{"$f":"IF(E191=\"\",\"\",\"hkg\")","v":""},null,{"$f":"IF(L21=\"\",\"\",L21)","v":""}]
[]
[null,{"$f":"IF(AF23>1,VLOOKUP(AF23,_Afg07,2),\"\")","v":""},{"$f":"IF(AN23>0,AN23,\"\")","v":""},{"$f":"IF(C193=\"\",\"\",\"ha\")","v":""},{"$f":"IF(AO23>0,AO23,\"\")","v":""},{"$f":"IF(E193=\"\",\"\",\"hkg\")","v":""}]
[]
[]
[3,{"$f":"IF(AF26>1,VLOOKUP(AF26,_Afg07,2),\"\")","v":""},{"$f":"IF(AN26>0,AN26,\"\")","v":""},{"$f":"IF(C196=\"\",\"\",\"ha\")","v":""},{"$f":"IF(AO26>0,AO26,\"\")","v":""},{"$f":"IF(E196=\"\",\"\",\"hkg\")","v":""},null,{"$f":"IF(L26=\"\",\"\",L26)","v":""}]
[]
[null,{"$f":"IF(AF28>1,VLOOKUP(AF28,_Afg07,2),\"\")","v":""},{"$f":"IF(AN28>0,AN28,\"\")","v":""},{"$f":"IF(C198=\"\",\"\",\"ha\")","v":""},{"$f":"IF(AO28>0,AO28,\"\")","v":""},{"$f":"IF(E198=\"\",\"\",\"hkg\")","v":""}]
[]
[]
[4,{"$f":"IF(AF31>1,VLOOKUP(AF31,_Afg07,2),\"\")","v":""},{"$f":"IF(AN31>0,AN31,\"\")","v":""},{"$f":"IF(C201=\"\",\"\",\"ha\")","v":""},{"$f":"IF(AO31>0,AO31,\"\")","v":""},{"$f":"IF(E201=\"\",\"\",\"hkg\")","v":""},null,{"$f":"IF(L31=\"\",\"\",L31)","v":""}]
[]
[null,{"$f":"IF(AF33>1,VLOOKUP(AF33,_Afg07,2),\"\")","v":""},{"$f":"IF(AN33>0,AN33,\"\")","v":""},{"$f":"IF(C203=\"\",\"\",\"ha\")","v":""},{"$f":"IF(AO33>0,AO33,\"\")","v":""},{"$f":"IF(E203=\"\",\"\",\"hkg\")","v":""}]
[]
[]
[5,{"$f":"IF(AF36>1,VLOOKUP(AF36,_Afg07,2),\"\")","v":""},{"$f":"IF(AN36>0,AN36,\"\")","v":""},{"$f":"IF(C206=\"\",\"\",\"ha\")","v":""},{"$f":"IF(AO36>0,AO36,\"\")","v":""},{"$f":"IF(E206=\"\",\"\",\"hkg\")","v":""},null,{"$f":"IF(L36=\"\",\"\",L36)","v":""}]
[]
[null,{"$f":"IF(AF38>1,VLOOKUP(AF38,_Afg07,2),\"\")","v":""},{"$f":"IF(AN38>0,AN38,\"\")","v":""},{"$f":"IF(C208=\"\",\"\",\"ha\")","v":""},{"$f":"IF(AO38>0,AO38,\"\")","v":""},{"$f":"IF(E208=\"\",\"\",\"hkg\")","v":""}]
[]
[]
[6,{"$f":"IF(AF41>1,VLOOKUP(AF41,_Afg07,2),\"\")","v":""},{"$f":"IF(AN41>0,AN41,\"\")","v":""},{"$f":"IF(C211=\"\",\"\",\"ha\")","v":""},{"$f":"IF(AO41>0,AO41,\"\")","v":""},{"$f":"IF(E211=\"\",\"\",\"hkg\")","v":""},null,{"$f":"IF(L41=\"\",\"\",L41)","v":""}]
[]
[null,{"$f":"IF(AF43>1,VLOOKUP(AF43,_Afg07,2),\"\")","v":""},{"$f":"IF(AN43>0,AN43,\"\")","v":""},{"$f":"IF(C213=\"\",\"\",\"ha\")","v":""},{"$f":"IF(AO43>0,AO43,\"\")","v":""},{"$f":"IF(E213=\"\",\"\",\"hkg\")","v":""}]
[]
[]
[7,{"$f":"IF(AF46>1,VLOOKUP(AF46,_Afg07,2),\"\")","v":""},{"$f":"IF(AN46>0,AN46,\"\")","v":""},{"$f":"IF(C216=\"\",\"\",\"ha\")","v":""},{"$f":"IF(AO46>0,AO46,\"\")","v":""},{"$f":"IF(E216=\"\",\"\",\"hkg\")","v":""},null,{"$f":"IF(L46=\"\",\"\",L46)","v":""}]
[]
[null,{"$f":"IF(AF48>1,VLOOKUP(AF48,_Afg07,2),\"\")","v":""},{"$f":"IF(AN48>0,AN48,\"\")","v":""},{"$f":"IF(C218=\"\",\"\",\"ha\")","v":""},{"$f":"IF(AO48>0,AO48,\"\")","v":""},{"$f":"IF(E218=\"\",\"\",\"hkg\")","v":""}]
[]
[]
[]
["Delsædskifte 2"]
[]
["Marker/ejendom:",null,{"$f":"IF(C54<>\"\",C54,\"\")","v":""}]
[]
["Areal sædskifte 2:",null,{"$f":"C58","v":0},{"$f":"IF(C226=\"\",\"\",\"ha\")","v":"ha"},null,{"$f":"VLOOKUP(JBnr3,Jordtyper,2)","v":"JB 5-6"}]
[]
[]
[1,{"$f":"IF(AF62>1,VLOOKUP(AF62,_Afg07,2),\"\")","v":""},{"$f":"IF(AN62>0,AN62,\"\")","v":""},{"$f":"IF(C229=\"\",\"\",\"ha\")","v":""},{"$f":"IF(AO62>0,AO62,\"\")","v":""},{"$f":"IF(E229=\"\",\"\",\"hkg\")","v":""},null,{"$f":"IF(L62=\"\",\"\",L62)","v":""}]
[]
[null,{"$f":"IF(AF64>1,VLOOKUP(AF64,_Afg07,2),\"\")","v":""},{"$f":"IF(AN64>0,AN64,\"\")","v":""},{"$f":"IF(C231=\"\",\"\",\"ha\")","v":""},{"$f":"IF(AO64>0,AO64,\"\")","v":""},{"$f":"IF(E231=\"\",\"\",\"hkg\")","v":""}]
[]
[]
[2,{"$f":"IF(AF67>1,VLOOKUP(AF67,_Afg07,2),\"\")","v":""},{"$f":"IF(AN67>0,AN67,\"\")","v":""},{"$f":"IF(C234=\"\",\"\",\"ha\")","v":""},{"$f":"IF(AO67>0,AO67,\"\")","v":""},{"$f":"IF(E234=\"\",\"\",\"hkg\")","v":""},null,{"$f":"IF(L67=\"\",\"\",L67)","v":""}]
[]
[null,{"$f":"IF(AF69>1,VLOOKUP(AF69,_Afg07,2),\"\")","v":""},{"$f":"IF(AN69>0,AN69,\"\")","v":""},{"$f":"IF(C236=\"\",\"\",\"ha\")","v":""},{"$f":"IF(AO69>0,AO69,\"\")","v":""},{"$f":"IF(E236=\"\",\"\",\"hkg\")","v":""}]
[]
[]
[3,{"$f":"IF(AF72>1,VLOOKUP(AF72,_Afg07,2),\"\")","v":""},{"$f":"IF(AN72>0,AN72,\"\")","v":""},{"$f":"IF(C239=\"\",\"\",\"ha\")","v":""},{"$f":"IF(AO72>0,AO72,\"\")","v":""},{"$f":"IF(E239=\"\",\"\",\"hkg\")","v":""},null,{"$f":"IF(L72=\"\",\"\",L72)","v":""}]
[]
[null,{"$f":"IF(AF74>1,VLOOKUP(AF74,_Afg07,2),\"\")","v":""},{"$f":"IF(AN74>0,AN74,\"\")","v":""},{"$f":"IF(C241=\"\",\"\",\"ha\")","v":""},{"$f":"IF(AO74>0,AO74,\"\")","v":""},{"$f":"IF(E241=\"\",\"\",\"hkg\")","v":""}]
[]
[]
[4,{"$f":"IF(AF77>1,VLOOKUP(AF77,_Afg07,2),\"\")","v":""},{"$f":"IF(AN77>0,AN77,\"\")","v":""},{"$f":"IF(C244=\"\",\"\",\"ha\")","v":""},{"$f":"IF(AO77>0,AO77,\"\")","v":""},{"$f":"IF(E244=\"\",\"\",\"hkg\")","v":""},null,{"$f":"IF(L77=\"\",\"\",L77)","v":""}]
[]
[null,{"$f":"IF(AF79>1,VLOOKUP(AF79,_Afg07,2),\"\")","v":""},{"$f":"IF(AN79>0,AN79,\"\")","v":""},{"$f":"IF(C246=\"\",\"\",\"ha\")","v":""},{"$f":"IF(AO79>0,AO79,\"\")","v":""},{"$f":"IF(E246=\"\",\"\",\"hkg\")","v":""}]
[]
[]
[5,{"$f":"IF(AF82>1,VLOOKUP(AF82,_Afg07,2),\"\")","v":""},{"$f":"IF(AN82>0,AN82,\"\")","v":""},{"$f":"IF(C249=\"\",\"\",\"ha\")","v":""},{"$f":"IF(AO82>0,AO82,\"\")","v":""},{"$f":"IF(E249=\"\",\"\",\"hkg\")","v":""},null,{"$f":"IF(L82=\"\",\"\",L82)","v":""}]
[]
[null,{"$f":"IF(AF84>1,VLOOKUP(AF84,_Afg07,2),\"\")","v":""},{"$f":"IF(AN84>0,AN84,\"\")","v":""},{"$f":"IF(C251=\"\",\"\",\"ha\")","v":""},{"$f":"IF(AO84>0,AO84,\"\")","v":""},{"$f":"IF(E251=\"\",\"\",\"hkg\")","v":""}]
[]
[]
[6,{"$f":"IF(AF87>1,VLOOKUP(AF87,_Afg07,2),\"\")","v":""},{"$f":"IF(AN87>0,AN87,\"\")","v":""},{"$f":"IF(C254=\"\",\"\",\"ha\")","v":""},{"$f":"IF(AO87>0,AO87,\"\")","v":""},{"$f":"IF(E254=\"\",\"\",\"hkg\")","v":""},null,{"$f":"IF(L87=\"\",\"\",L87)","v":""}]
[]
[null,{"$f":"IF(AF89>1,VLOOKUP(AF89,_Afg07,2),\"\")","v":""},{"$f":"IF(AN89>0,AN89,\"\")","v":""},{"$f":"IF(C256=\"\",\"\",\"ha\")","v":""},{"$f":"IF(AO89>0,AO89,\"\")","v":""},{"$f":"IF(E256=\"\",\"\",\"hkg\")","v":""}]
[]
[]
[7,{"$f":"IF(AF92>1,VLOOKUP(AF92,_Afg07,2),\"\")","v":""},{"$f":"IF(AN92>0,AN92,\"\")","v":""},{"$f":"IF(C259=\"\",\"\",\"ha\")","v":""},{"$f":"IF(AO92>0,AO92,\"\")","v":""},{"$f":"IF(E259=\"\",\"\",\"hkg\")","v":""},null,{"$f":"IF(L92=\"\",\"\",L92)","v":""}]
[]
[null,{"$f":"IF(AF94>1,VLOOKUP(AF94,_Afg07,2),\"\")","v":""},{"$f":"IF(AN94>0,AN94,\"\")","v":""},{"$f":"IF(C261=\"\",\"\",\"ha\")","v":""},{"$f":"IF(AO94>0,AO94,\"\")","v":""},{"$f":"IF(E261=\"\",\"\",\"hkg\")","v":""}]
[]
[{"$f":"\"Sædskifteplan - fortsat\"","v":"Sædskifteplan - fortsat"}]
[]
["Delsædskifte 3"]
[]
["Marker/ejendom:",null,{"$f":"IF(C100<>\"\",C100,\"\")","v":""}]
[]
["Areal sædskifte 3:",null,{"$f":"C104","v":0},{"$f":"IF(C269=\"\",\"\",\"ha\")","v":"ha"},null,{"$f":"VLOOKUP(JBnr4,Jordtyper,2)","v":"JB 5-6"}]
[]
[]
[1,{"$f":"IF(AF108>1,VLOOKUP(AF108,_Afg07,2),\"\")","v":""},{"$f":"IF(AN108>0,AN108,\"\")","v":""},{"$f":"IF(C272=\"\",\"\",\"ha\")","v":""},{"$f":"IF(AO108>0,AO108,\"\")","v":""},{"$f":"IF(E272=\"\",\"\",\"hkg\")","v":""},null,{"$f":"IF(L108=\"\",\"\",L108)","v":""}]
[]
[null,{"$f":"IF(AF110>1,VLOOKUP(AF110,_Afg07,2),\"\")","v":""},{"$f":"IF(AN110>0,AN110,\"\")","v":""},{"$f":"IF(C274=\"\",\"\",\"ha\")","v":""},{"$f":"IF(AO110>0,AO110,\"\")","v":""},{"$f":"IF(E274=\"\",\"\",\"hkg\")","v":""}]
[]
[]
[2,{"$f":"IF(AF113>1,VLOOKUP(AF113,_Afg07,2),\"\")","v":""},{"$f":"IF(AN113>0,AN113,\"\")","v":""},{"$f":"IF(C277=\"\",\"\",\"ha\")","v":""},{"$f":"IF(AO113>0,AO113,\"\")","v":""},{"$f":"IF(E277=\"\",\"\",\"hkg\")","v":""},null,{"$f":"IF(L113=\"\",\"\",L113)","v":""}]
[]
[null,{"$f":"IF(AF115>1,VLOOKUP(AF115,_Afg07,2),\"\")","v":""},{"$f":"IF(AN115>0,AN115,\"\")","v":""},{"$f":"IF(C279=\"\",\"\",\"ha\")","v":""},{"$f":"IF(AO115>0,AO115,\"\")","v":""},{"$f":"IF(E279=\"\",\"\",\"hkg\")","v":""}]
[]
[]
[3,{"$f":"IF(AF118>1,VLOOKUP(AF118,_Afg07,2),\"\")","v":""},{"$f":"IF(AN118>0,AN118,\"\")","v":""},{"$f":"IF(C282=\"\",\"\",\"ha\")","v":""},{"$f":"IF(AO118>0,AO118,\"\")","v":""},{"$f":"IF(E282=\"\",\"\",\"hkg\")","v":""},null,{"$f":"IF(L118=\"\",\"\",L118)","v":""}]
[]
[null,{"$f":"IF(AF120>1,VLOOKUP(AF120,_Afg07,2),\"\")","v":""},{"$f":"IF(AN120>0,AN120,\"\")","v":""},{"$f":"IF(C284=\"\",\"\",\"ha\")","v":""},{"$f":"IF(AO120>0,AO120,\"\")","v":""},{"$f":"IF(E284=\"\",\"\",\"hkg\")","v":""}]
[]
[]
[4,{"$f":"IF(AF123>1,VLOOKUP(AF123,_Afg07,2),\"\")","v":""},{"$f":"IF(AN123>0,AN123,\"\")","v":""},{"$f":"IF(C287=\"\",\"\",\"ha\")","v":""},{"$f":"IF(AO123>0,AO123,\"\")","v":""},{"$f":"IF(E287=\"\",\"\",\"hkg\")","v":""},null,{"$f":"IF(L123=\"\",\"\",L123)","v":""}]
[]
[null,{"$f":"IF(AF125>1,VLOOKUP(AF125,_Afg07,2),\"\")","v":""},{"$f":"IF(AN125>0,AN125,\"\")","v":""},{"$f":"IF(C289=\"\",\"\",\"ha\")","v":""},{"$f":"IF(AO125>0,AO125,\"\")","v":""},{"$f":"IF(E289=\"\",\"\",\"hkg\")","v":""}]
[]
[]
[5,{"$f":"IF(AF128>1,VLOOKUP(AF128,_Afg07,2),\"\")","v":""},{"$f":"IF(AN128>0,AN128,\"\")","v":""},{"$f":"IF(C292=\"\",\"\",\"ha\")","v":""},{"$f":"IF(AO128>0,AO128,\"\")","v":""},{"$f":"IF(E292=\"\",\"\",\"hkg\")","v":""},null,{"$f":"IF(L128=\"\",\"\",L128)","v":""}]
[]
[null,{"$f":"IF(AF130>1,VLOOKUP(AF130,_Afg07,2),\"\")","v":""},{"$f":"IF(AN130>0,AN130,\"\")","v":""},{"$f":"IF(C294=\"\",\"\",\"ha\")","v":""},{"$f":"IF(AO130>0,AO130,\"\")","v":""},{"$f":"IF(E294=\"\",\"\",\"hkg\")","v":""}]
[]
[]
[6,{"$f":"IF(AF133>1,VLOOKUP(AF133,_Afg07,2),\"\")","v":""},{"$f":"IF(AN133>0,AN133,\"\")","v":""},{"$f":"IF(C297=\"\",\"\",\"ha\")","v":""},{"$f":"IF(AO133>0,AO133,\"\")","v":""},{"$f":"IF(E297=\"\",\"\",\"hkg\")","v":""},null,{"$f":"IF(L133=\"\",\"\",L133)","v":""}]
[]
[null,{"$f":"IF(AF135>1,VLOOKUP(AF135,_Afg07,2),\"\")","v":""},{"$f":"IF(AN135>0,AN135,\"\")","v":""},{"$f":"IF(C299=\"\",\"\",\"ha\")","v":""},{"$f":"IF(AO135>0,AO135,\"\")","v":""},{"$f":"IF(E299=\"\",\"\",\"hkg\")","v":""}]
[]
[]
[7,{"$f":"IF(AF138>1,VLOOKUP(AF138,_Afg07,2),\"\")","v":""},{"$f":"IF(AN138>0,AN138,\"\")","v":""},{"$f":"IF(C302=\"\",\"\",\"ha\")","v":""},{"$f":"IF(AO138>0,AO138,\"\")","v":""},{"$f":"IF(E302=\"\",\"\",\"hkg\")","v":""},null,{"$f":"IF(L138=\"\",\"\",L138)","v":""}]
[]
[null,{"$f":"IF(AF140>1,VLOOKUP(AF140,_Afg07,2),\"\")","v":""},{"$f":"IF(AN140>0,AN140,\"\")","v":""},{"$f":"IF(C304=\"\",\"\",\"ha\")","v":""},{"$f":"IF(AO140>0,AO140,\"\")","v":""},{"$f":"IF(E304=\"\",\"\",\"hkg\")","v":""}]
[]
[]
[]
["Samlet produktion"]
[]
["Samlet areal",null,{"$f":"C183+C226+C269","v":0},{"$f":"IF(C310=\"\",\"\",\"ha\")","v":"ha"}]
[]
[null,null,"Areal",null,"Gns. udbytte",null,null,"Udbytte i alt",null,"Foderproduktion"]
[]
[{"$f":"IF(AF147>1,VLOOKUP(AF147,_Afg07,2),\"\")","v":""},null,{"$f":"C147","v":false},{"$f":"D147","v":"ha"},{"$f":"E147","v":""},{"$f":"F147","v":""},{"$f":"G147","v":""},null,{"$f":"I147","v":""},{"$f":"J147","v":""},null,{"$f":"L147","v":""}]
[]
[{"$f":"IF(AF149>1,VLOOKUP(AF149,_Afg07,2),\"\")","v":""},null,{"$f":"C149","v":""},{"$f":"D149","v":""},{"$f":"E149","v":""},{"$f":"F149","v":""},{"$f":"G149","v":""},null,{"$f":"I149","v":""},{"$f":"J149","v":""},null,{"$f":"L149","v":""}]
[]
[{"$f":"IF(AF151>1,VLOOKUP(AF151,_Afg07,2),\"\")","v":""},null,{"$f":"C151","v":""},{"$f":"D151","v":""},{"$f":"E151","v":""},{"$f":"F151","v":""},{"$f":"G151","v":""},null,{"$f":"I151","v":""},{"$f":"J151","v":""},null,{"$f":"L151","v":""}]
[]
[{"$f":"IF(AF153>1,VLOOKUP(AF153,_Afg07,2),\"\")","v":""},null,{"$f":"C153","v":""},{"$f":"D153","v":""},{"$f":"E153","v":""},{"$f":"F153","v":""},{"$f":"G153","v":""},null,{"$f":"I153","v":""},{"$f":"J153","v":""},null,{"$f":"L153","v":""}]
[]
[{"$f":"IF(AF155>1,VLOOKUP(AF155,_Afg07,2),\"\")","v":""},null,{"$f":"C155","v":""},{"$f":"D155","v":""},{"$f":"E155","v":""},{"$f":"F155","v":""},{"$f":"G155","v":""},null,{"$f":"I155","v":""},{"$f":"J155","v":""},null,{"$f":"L155","v":""}]
[]
[{"$f":"IF(AF157>1,VLOOKUP(AF157,_Afg07,2),\"\")","v":""},null,{"$f":"C157","v":""},{"$f":"D157","v":""},{"$f":"E157","v":""},{"$f":"F157","v":""},{"$f":"G157","v":""},null,{"$f":"I157","v":""},{"$f":"J157","v":""},null,{"$f":"L157","v":""}]
[]
[{"$f":"IF(AF159>1,VLOOKUP(AF159,_Afg07,2),\"\")","v":""},null,{"$f":"C159","v":""},{"$f":"D159","v":""},{"$f":"E159","v":""},{"$f":"F159","v":""},{"$f":"G159","v":""},null,{"$f":"I159","v":""},{"$f":"J159","v":""},null,{"$f":"L159","v":""}]
[]
[{"$f":"IF(AF161>1,VLOOKUP(AF161,_Afg07,2),\"\")","v":""},null,{"$f":"C161","v":""},{"$f":"D161","v":""},{"$f":"E161","v":""},{"$f":"F161","v":""},{"$f":"G161","v":""},null,{"$f":"I161","v":""},{"$f":"J161","v":""},null,{"$f":"L161","v":""}]
[]
[null,null,null,null,null,null,null,null,"I alt",{"$f":"AG162","v":0},null,{"$f":"IF(J330<>\"\",\"FEsv\",\"\")","v":"FEsv"}]
[]
[]
[{"$f":"\"Areal med efterafgrøder udgør \"&AX148&\" % af arealet.\"","v":"Areal med efterafgrøder udgør  % af arealet."}]
[]
[]
[]
["Foderbehov og foderproduktion (korn)"]
[]
["Besætning",null,null,null,null,null,null,null,null,null,null,null,"Foderbehov i korn (FEsv)"]
[]
["Søer m. smågrise",null,{"$f":"IF(C168<>\"\",C168,\"\")","v":""},{"$f":"IF(C341<>\"\",\"årssøer\",\"\")","v":""},null,null,null,null,null,{"$f":"IF(AG168=0,\"\",AG168)","v":""},null,{"$f":"IF(J341<>\"\",\"FE\",\"\")","v":""}]
[]
["Smågrise",null,{"$f":"IF(C170<>\"\",C170,\"\")","v":""},{"$f":"IF(C343<>\"\",\"stk.\",\"\")","v":""},{"$f":"IF(C343<>\"\",\"Fra\",\"\")","v":""},{"$f":"IF(C343<>\"\",F170,\"\")","v":""},{"$f":"IF(C343<>\"\",\"kg   Til\",\"\")","v":""},{"$f":"IF(C343<>\"\",H170,\"\")","v":""},{"$f":"IF(C343<>\"\",\"kg\",\"\")","v":""},{"$f":"IF(AG170=0,\"\",AG170)","v":""},null,{"$f":"IF(J343<>\"\",\"FEsv\",\"\")","v":""}]
[]
["Slagtesvin",null,{"$f":"IF(C172<>\"\",C172,\"\")","v":""},{"$f":"IF(C345<>\"\",\"stk.\",\"\")","v":""},{"$f":"IF(C345<>\"\",\"Fra\",\"\")","v":""},{"$f":"IF(C345<>\"\",F172,\"\")","v":""},{"$f":"IF(C345<>\"\",\"kg   Til\",\"\")","v":""},{"$f":"IF(C345<>\"\",H172,\"\")","v":""},{"$f":"IF(C345<>\"\",\"kg\",\"\")","v":""},{"$f":"IF(AG172=0,\"\",AG172)","v":""},null,{"$f":"IF(J345<>\"\",\"FEsv\",\"\")","v":""}]
[]
[]
["Kornarters andel af kornration (vægtpct.)"]
[]
[null,null,"Hvede",null,"Byg",null,"Havre",null,"Rug/Triticale",null,"Majs"]
[]
["Søer m. smågrise",null,{"$f":"IF(AB168<>\"\",AB168,\"\")","v":50},{"$f":"IF(C352<>\"\",\"%\",\"\")","v":"%"},{"$f":"IF(R168<>\"\",R168,\"\")","v":50},{"$f":"IF(E352<>\"\",\"%\",\"\")","v":"%"},{"$f":"IF(T168<>\"\",T168,\"\")","v":""},{"$f":"IF(G352<>\"\",\"%\",\"\")","v":""},{"$f":"IF(OR(V168<>\"\",X168<>\"\"),V168+X168,\"\")","v":""},{"$f":"IF(I352<>\"\",\"%\",\"\")","v":""},{"$f":"IF(Z168<>\"\",Z168,\"\")","v":""},{"$f":"IF(K352<>\"\",\"%\",\"\")","v":""}]
[]
["Smågrise",null,{"$f":"IF(AB170<>\"\",AB170,\"\")","v":78},{"$f":"IF(C354<>\"\",\"%\",\"\")","v":"%"},{"$f":"IF(R170<>\"\",R170,\"\")","v":22},{"$f":"IF(E354<>\"\",\"%\",\"\")","v":"%"},{"$f":"IF(T170<>\"\",T170,\"\")","v":""},{"$f":"IF(G354<>\"\",\"%\",\"\")","v":""},{"$f":"IF(OR(V170<>\"\",X170<>\"\"),V170+X170,\"\")","v":""},{"$f":"IF(I354<>\"\",\"%\",\"\")","v":""},{"$f":"IF(Z170<>\"\",Z170,\"\")","v":""},{"$f":"IF(K354<>\"\",\"%\",\"\")","v":""}]
[]
["Slagtesvin",null,{"$f":"IF(AB172<>\"\",AB172,\"\")","v":75},{"$f":"IF(C356<>\"\",\"%\",\"\")","v":"%"},{"$f":"IF(R172<>\"\",R172,\"\")","v":25},{"$f":"IF(E356<>\"\",\"%\",\"\")","v":"%"},{"$f":"IF(T172<>\"\",T172,\"\")","v":""},{"$f":"IF(G356<>\"\",\"%\",\"\")","v":""},{"$f":"IF(OR(V172<>\"\",X172<>\"\"),V172+X172,\"\")","v":""},{"$f":"IF(I356<>\"\",\"%\",\"\")","v":""},{"$f":"IF(Z172<>\"\",Z172,\"\")","v":""},{"$f":"IF(K356<>\"\",\"%\",\"\")","v":""}]
[]
[]
["Foderbehov og -produktion (korn)"]
[]
[null,null,null,"Foderbehov ",null,"Foderproduktion",null,null,null,"Skal købes ",null,null,"Kan sælges "]
[]
["Hvede",null,{"$f":"IF(AO174>0,AO174,\"\")","v":""},{"$f":"IF(C363<>\"\",\"Hkg\",\"\")","v":""},{"$f":"IF(ISERROR(AI162),\"\",IF(AI162>0,AI162,\"\"))","v":""},null,{"$f":"IF(E363<>\"\",\"Hkg\",\"\")","v":""},{"$f":"IF(ISERROR($AO$174-$AI$162),\"\",IF($AO$174-$AI$162>0,$AO$174-$AI$162,\"\"))","v":""},null,{"$f":"IF(H363<>\"\",\"Hkg\",\"\")","v":""},{"$f":"IF(ISERROR($AO$174-$AI$162),\"\",IF($AO$174-$AI$162<0,-($AO$174-$AI$162),\"\"))","v":""},null,{"$f":"IF(K363<>\"\",\"Hkg\",\"\")","v":""}]
[]
["Byg",null,{"$f":"IF(AJ174>0,AJ174,\"\")","v":""},{"$f":"IF(C365<>\"\",\"Hkg\",\"\")","v":""},{"$f":"IF(ISERROR(AK162),\"\",IF(AK162>0,AK162,\"\"))","v":""},null,{"$f":"IF(E365<>\"\",\"Hkg\",\"\")","v":""},{"$f":"IF(ISERROR($AJ$174-$AK$162),\"\",IF($AJ$174-$AK$162>0,$AJ$174-$AK$162,\"\"))","v":""},null,{"$f":"IF(H365<>\"\",\"Hkg\",\"\")","v":""},{"$f":"IF(ISERROR($AJ$174-$AK$162),\"\",IF($AJ$174-$AK$162<0,-($AJ$174-$AK$162),\"\"))","v":""},null,{"$f":"IF(K365<>\"\",\"Hkg\",\"\")","v":""}]
[]
["Havre",null,{"$f":"IF(AK174>0,AK174,\"\")","v":""},{"$f":"IF(C367<>\"\",\"Hkg\",\"\")","v":""},{"$f":"IF(ISERROR(AM162),\"\",IF(AM162>0,AM162,\"\"))","v":""},null,{"$f":"IF(E367<>\"\",\"Hkg\",\"\")","v":""},{"$f":"IF(ISERROR($AK$174-$AM$162),\"\",IF($AK$174-$AM$162>0,$AK$174-$AM$162,\"\"))","v":""},null,{"$f":"IF(H367<>\"\",\"Hkg\",\"\")","v":""},{"$f":"IF(ISERROR($AK$174-$AM$162),\"\",IF($AK$174-$AM$162<0,-($AK$174-$AM$162),\"\"))","v":""},null,{"$f":"IF(K367<>\"\",\"Hkg\",\"\")","v":""}]
[]
["Rug",null,{"$f":"IF(AL174>0,AL174,\"\")","v":""},{"$f":"IF(C369<>\"\",\"Hkg\",\"\")","v":""},{"$f":"IF(AO162>0,AO162,\"\")","v":""},null,{"$f":"IF(E369<>\"\",\"Hkg\",\"\")","v":""},{"$f":"IF($AL$174-$AO$162>0,$AL$174-$AO$162,\"\")","v":""},null,{"$f":"IF(H369<>\"\",\"Hkg\",\"\")","v":""},{"$f":"IF($AL$174-$AO$162<0,-($AL$174-$AO$162),\"\")","v":""},null,{"$f":"IF(K369<>\"\",\"Hkg\",\"\")","v":""}]
[]
["Triticale",null,{"$f":"IF(AM174>0,AM174,\"\")","v":""},{"$f":"IF(C371<>\"\",\"Hkg\",\"\")","v":""},{"$f":"IF(AQ162>0,AQ162,\"\")","v":""},null,{"$f":"IF(E371<>\"\",\"Hkg\",\"\")","v":""},{"$f":"IF($AM$174-$AQ$162>0,$AM$174-$AQ$162,\"\")","v":""},null,{"$f":"IF(H371<>\"\",\"Hkg\",\"\")","v":""},{"$f":"IF($AM$174-$AQ$162<0,-($AM$174-$AQ$162),\"\")","v":""},null,{"$f":"IF(K371<>\"\",\"Hkg\",\"\")","v":""}]
[]
["Majs",null,{"$f":"IF(AN174>0,AN174,\"\")","v":""},{"$f":"IF(C373<>\"\",\"Hkg\",\"\")","v":""},{"$f":"IF(AS162>0,AS162,\"\")","v":""},null,{"$f":"IF(E373<>\"\",\"Hkg\",\"\")","v":""},{"$f":"IF($AN$174-$AS$162>0,$AN$174-$AS$162,\"\")","v":""},null,{"$f":"IF(H373<>\"\",\"Hkg\",\"\")","v":""},{"$f":"IF($AN$174-$AS$162<0,-($AN$174-$AS$162),\"\")","v":""},null,{"$f":"IF(K373<>\"\",\"Hkg\",\"\")","v":""}]

{"sheet":"Ark4","index":3,"n_rows":0,"n_cols":0,"rows_kept":0,"cut":false,"hidden":true,"merged":[]}